{"text_format":"1","workbook":"xlsx","n_sheets":4,"sheets":["Sprint","Analysis","Capacity","Team Roster"],"not_rendered":{"charts":2,"images":2,"macros":1,"external_links":0,"defined_names":32,"comments":1,"pivot_tables":0},"unopened":[],"bounds":{"document_bytes":16777216,"sheet_cells":100000,"rows_first":2000,"rows_last":500,"rows_between":2000,"halvings":0,"cell_chars":16384,"cell_head_chars":4096},"cells_cut":0,"cells_raw":0,"read":"whole","date_system":"1900"}

{"sheet":"Sprint","index":0,"n_rows":51,"n_cols":129,"rows_kept":51,"cut":false,"hidden":false,"merged":[[0,121,0,123],[46,121,46,122],[0,88,0,90],[46,88,46,89],[46,91,46,92],[0,91,0,93],[0,94,0,96],[46,94,46,95],[0,118,0,120],[46,118,46,119],[0,106,0,108],[46,106,46,107],[0,103,0,105],[46,103,46,104],[0,100,0,102],[46,100,46,101],[0,124,0,126],[46,124,46,125],[46,28,46,29],[46,25,46,26],[0,112,0,114],[46,112,46,113],[0,115,0,117],[46,115,46,116],[0,82,0,84],[46,82,46,83],[0,70,0,72],[46,70,46,71],[0,97,0,99],[46,97,46,98],[0,85,0,87],[46,85,46,86],[46,58,46,59],[46,61,46,62],[46,49,46,50],[46,52,46,53],[0,109,0,111],[46,109,46,110],[46,67,46,68],[46,55,46,56],[46,64,46,65],[0,64,0,66],[0,67,0,69],[0,55,0,57],[0,58,0,60],[0,61,0,63],[0,49,0,51],[0,52,0,54],[46,19,46,20],[0,7,0,9],[0,10,0,12],[46,40,46,41],[46,43,46,44],[46,7,46,8],[46,10,46,11],[46,13,46,14],[46,16,46,17],[0,13,0,15],[0,16,0,18],[0,19,0,21],[46,46,46,47],[46,22,46,23],[0,28,0,30],[0,25,0,27],[0,22,0,24],[0,40,0,42],[46,31,46,32],[46,34,46,35],[46,37,46,38],[0,43,0,45],[0,46,0,48],[0,34,0,36],[0,37,0,39],[0,31,0,33],[46,79,46,80],[0,79,0,81],[0,73,0,75],[46,73,46,74],[0,76,0,78],[46,76,46,77]]}
[null,null,null,"Start Date","2006-07-03",null,null,{"$f":"SprintStart","v":"2017-05-01"},null,null,{"$f":"IF(AND(SkipWeekends, WEEKDAY(H1)=6),H1+3, H1+1)","v":"2017-05-02"},null,null,{"$f":"IF(AND(SkipWeekends, WEEKDAY(K1)=6),K1+3, K1+1)","v":"2017-05-03"},null,null,{"$f":"IF(AND(SkipWeekends, WEEKDAY(N1)=6),N1+3, N1+1)","v":"2017-05-04"},null,null,{"$f":"IF(AND(SkipWeekends, WEEKDAY(Q1)=6),Q1+3, Q1+1)","v":"2017-05-05"},null,null,{"$f":"IF(AND(SkipWeekends, WEEKDAY(T1)=6),T1+3, T1+1)","v":"2017-05-06"},null,null,{"$f":"IF(AND(SkipWeekends, WEEKDAY(W1)=6),W1+3, W1+1)","v":"2017-05-07"},null,null,{"$f":"IF(AND(SkipWeekends, WEEKDAY(Z1)=6),Z1+3, Z1+1)","v":"2017-05-08"},null,null,{"$f":"IF(AND(SkipWeekends, WEEKDAY(AC1)=6),AC1+3, AC1+1)","v":"2017-05-09"},null,null,{"$f":"IF(AND(SkipWeekends, WEEKDAY(AF1)=6),AF1+3, AF1+1)","v":"2017-05-10"},null,null,{"$f":"IF(AND(SkipWeekends, WEEKDAY(AI1)=6),AI1+3, AI1+1)","v":"2017-05-11"},null,null,{"$f":"IF(AND(SkipWeekends, WEEKDAY(AL1)=6),AL1+3, AL1+1)","v":"2017-05-12"},null,null,{"$f":"IF(AND(SkipWeekends, WEEKDAY(AO1)=6),AO1+3, AO1+1)","v":"2017-05-13"},null,null,{"$f":"IF(AND(SkipWeekends, WEEKDAY(AR1)=6),AR1+3, AR1+1)","v":"2017-05-14"},null,null,{"$f":"IF(AND(SkipWeekends, WEEKDAY(AU1)=6),AU1+3, AU1+1)","v":"2017-05-15"},null,null,{"$f":"IF(AND(SkipWeekends, WEEKDAY(AX1)=6),AX1+3, AX1+1)","v":"2017-05-16"},null,null,{"$f":"IF(AND(SkipWeekends, WEEKDAY(BA1)=6),BA1+3, BA1+1)","v":"2017-05-17"},null,null,{"$f":"IF(AND(SkipWeekends, WEEKDAY(BD1)=6),BD1+3, BD1+1)","v":"2017-05-18"},null,null,{"$f":"IF(AND(SkipWeekends, WEEKDAY(BG1)=6),BG1+3, BG1+1)","v":"2017-05-19"},null,null,{"$f":"IF(AND(SkipWeekends, WEEKDAY(BJ1)=6),BJ1+3, BJ1+1)","v":"2017-05-20"},null,null,{"$f":"IF(AND(SkipWeekends, WEEKDAY(BM1)=6),BM1+3, BM1+1)","v":"2017-05-21"},null,null,{"$f":"IF(AND(SkipWeekends, WEEKDAY(BP1)=6),BP1+3, BP1+1)","v":"2017-05-22"},null,null,{"$f":"IF(AND(SkipWeekends, WEEKDAY(BS1)=6),BS1+3, BS1+1)","v":"2017-05-23"},null,null,{"$f":"IF(AND(SkipWeekends, WEEKDAY(BV1)=6),BV1+3, BV1+1)","v":"2017-05-24"},null,null,{"$f":"IF(AND(SkipWeekends, WEEKDAY(BY1)=6),BY1+3, BY1+1)","v":"2017-05-25"},null,null,{"$f":"IF(AND(SkipWeekends, WEEKDAY(CB1)=6),CB1+3, CB1+1)","v":"2017-05-26"},null,null,{"$f":"IF(AND(SkipWeekends, WEEKDAY(CE1)=6),CE1+3, CE1+1)","v":"2017-05-27"},null,null,{"$f":"IF(AND(SkipWeekends, WEEKDAY(CH1)=6),CH1+3, CH1+1)","v":"2017-05-28"},null,null,{"$f":"IF(AND(SkipWeekends, WEEKDAY(CK1)=6),CK1+3, CK1+1)","v":"2017-05-29"},null,null,{"$f":"IF(AND(SkipWeekends, WEEKDAY(CN1)=6),CN1+3, CN1+1)","v":"2017-05-30"},null,null,{"$f":"IF(AND(SkipWeekends, WEEKDAY(CQ1)=6),CQ1+3, CQ1+1)","v":"2017-05-31"},null,null,{"$f":"IF(AND(SkipWeekends, WEEKDAY(CT1)=6),CT1+3, CT1+1)","v":"2017-06-01"},null,null,{"$f":"IF(AND(SkipWeekends, WEEKDAY(CW1)=6),CW1+3, CW1+1)","v":"2017-06-02"},null,null,{"$f":"IF(AND(SkipWeekends, WEEKDAY(CZ1)=6),CZ1+3, CZ1+1)","v":"2017-06-03"},null,null,{"$f":"IF(AND(SkipWeekends, WEEKDAY(DC1)=6),DC1+3, DC1+1)","v":"2017-06-04"},null,null,{"$f":"IF(AND(SkipWeekends, WEEKDAY(DF1)=6),DF1+3, DF1+1)","v":"2017-06-05"},null,null,{"$f":"IF(AND(SkipWeekends, WEEKDAY(DI1)=6),DI1+3, DI1+1)","v":"2017-06-06"},null,null,{"$f":"IF(AND(SkipWeekends, WEEKDAY(DL1)=6),DL1+3, DL1+1)","v":"2017-06-07"},null,null,{"$f":"IF(AND(SkipWeekends, WEEKDAY(DO1)=6),DO1+3, DO1+1)","v":"2017-06-08"},null,null,{"$f":"IF(AND(SkipWeekends, WEEKDAY(DR1)=6),DR1+3, DR1+1)","v":"2017-06-09"}]
[null,null,null,null,null,null,null,null,"Day 1",null,null,"Day 2",null,null,"Day 3",null,null,"Day 4",null,null,"Day 5",null,null,"Day 6",null,null,"Day 7",null,null,"Day 8",null,null,"Day 9",null,null,"Day 10",null,null,"Day 11",null,null,"Day 12",null,null,"Day 13",null,null,"Day 14",null,null,"Day 15",null,null,"Day 16",null,null,"Day 17",null,null,"Day 18",null,null,"Day 19",null,null,"Day 20",null,null,"Day 21",null,null,"Day 22",null,null,"Day 23",null,null,"Day 24",null,null,"Day 25",null,null,"Day 26",null,null,"Day 27",null,null,"Day 28",null,null,"Day 29",null,null,"Day 30",null,null,"Day 31",null,null,"Day 32",null,null,"Day 33",null,null,"Day 34",null,null,"Day 35",null,null,"Day 36",null,null,"Day 37",null,null,"Day 38",null,null,"Day 39",null,null,"Day 40"]
["Product Backlog Item or Group","Work item\nID","Sprint Work item Description","Owner","Status","Pri","Initial","Spent","Left",null,"Spent","Left",null,"Spent","Left",null,"Spent","Left",null,"Spent","Left",null,"Spent","Left",null,"Spent","Left",null,"Spent","Left",null,"Spent","Left",null,"Spent","Left",null,"Spent","Left",null,"Spent","Left",null,"Spent","Left",null,"Spent","Left",null,"Spent","Left",null,"Spent","Left",null,"Spent","Left",null,"Spent","Left",null,"Spent","Left",null,"Spent","Left",null,"Spent","Left",null,"Spent","Left",null,"Spent","Left",null,"Spent","Left",null,"Spent","Left",null,"Spent","Left",null,"Spent","Left",null,"Spent","Left",null,"Spent","Left",null,"Spent","Left",null,"Spent","Left",null,"Spent","Left",null,"Spent","Left",null,"Spent","Left",null,"Spent","Left",null,"Spent","Left",null,"Spent","Left",null,"Spent","Left",null,"Spent","Left",null,"Spent","Left",null,null,"Total Effort"]
[null,null,null,"Email",{"$f":"(INDEX(Burndown,ROW(E4)-ROW(E$3),MIN(TODAY()-SprintStart,29)*3+3))","v":"Pending"},1,0,0,{"$f":"MAX(G4-H4, 0)","v":0},{"$f":"IF(SUMPRODUCT($H$48:I$48,$H4:I4)<0.5, \"Pending\", IF(I4<0.5, \"Complete\", \"In Progress\"))","v":"Pending"},0,{"$f":"MAX(I4-K4,0)","v":0},{"$f":"IF(SUMPRODUCT($H$48:L$48,$H4:L4)<0.5, \"Pending\", IF(L4<0.5, \"Complete\", \"In Progress\"))","v":"Pending"},0,{"$f":"MAX(L4-N4,0)","v":0},{"$f":"IF(SUMPRODUCT($H$48:O$48,$H4:O4)<0.5, \"Pending\", IF(O4<0.5, \"Complete\", \"In Progress\"))","v":"Pending"},0,{"$f":"MAX(O4-Q4,0)","v":0},{"$f":"IF(SUMPRODUCT($H$48:R$48,$H4:R4)<0.5, \"Pending\", IF(R4<0.5, \"Complete\", \"In Progress\"))","v":"Pending"},0,{"$f":"MAX(R4-T4,0)","v":0},{"$f":"IF(SUMPRODUCT($H$48:U$48,$H4:U4)<0.5, \"Pending\", IF(U4<0.5, \"Complete\", \"In Progress\"))","v":"Pending"},0,{"$f":"MAX(U4-W4,0)","v":0},{"$f":"IF(SUMPRODUCT($H$48:X$48,$H4:X4)<0.5, \"Pending\", IF(X4<0.5, \"Complete\", \"In Progress\"))","v":"Pending"},0,{"$f":"MAX(X4-Z4,0)","v":0},{"$f":"IF(SUMPRODUCT($H$48:AA$48,$H4:AA4)<0.5, \"Pending\", IF(AA4<0.5, \"Complete\", \"In Progress\"))","v":"Pending"},0,{"$f":"MAX(AA4-AC4,0)","v":0},{"$f":"IF(SUMPRODUCT($H$48:AD$48,$H4:AD4)<0.5, \"Pending\", IF(AD4<0.5, \"Complete\", \"In Progress\"))","v":"Pending"},0,{"$f":"MAX(AD4-AF4,0)","v":0},{"$f":"IF(SUMPRODUCT($H$48:AG$48,$H4:AG4)<0.5, \"Pending\", IF(AG4<0.5, \"Complete\", \"In Progress\"))","v":"Pending"},0,{"$f":"MAX(AG4-AI4,0)","v":0},{"$f":"IF(SUMPRODUCT($H$48:AJ$48,$H4:AJ4)<0.5, \"Pending\", IF(AJ4<0.5, \"Complete\", \"In Progress\"))","v":"Pending"},0,{"$f":"MAX(AJ4-AL4,0)","v":0},{"$f":"IF(SUMPRODUCT($H$48:AM$48,$H4:AM4)<0.5, \"Pending\", IF(AM4<0.5, \"Complete\", \"In Progress\"))","v":"Pending"},0,{"$f":"MAX(AM4-AO4,0)","v":0},{"$f":"IF(SUMPRODUCT($H$48:AP$48,$H4:AP4)<0.5, \"Pending\", IF(AP4<0.5, \"Complete\", \"In Progress\"))","v":"Pending"},0,{"$f":"MAX(AP4-AR4,0)","v":0},{"$f":"IF(SUMPRODUCT($H$48:AS$48,$H4:AS4)<0.5, \"Pending\", IF(AS4<0.5, \"Complete\", \"In Progress\"))","v":"Pending"},0,{"$f":"MAX(AS4-AU4,0)","v":0},{"$f":"IF(SUMPRODUCT($H$48:AV$48,$H4:AV4)<0.5, \"Pending\", IF(AV4<0.5, \"Complete\", \"In Progress\"))","v":"Pending"},0,{"$f":"MAX(AV4-AX4,0)","v":0},{"$f":"IF(SUMPRODUCT($H$48:AY$48,$H4:AY4)<0.5, \"Pending\", IF(AY4<0.5, \"Complete\", \"In Progress\"))","v":"Pending"},0,{"$f":"MAX(AY4-BA4,0)","v":0},{"$f":"IF(SUMPRODUCT($H$48:BB$48,$H4:BB4)<0.5, \"Pending\", IF(BB4<0.5, \"Complete\", \"In Progress\"))","v":"Pending"},0,{"$f":"MAX(BB4-BD4,0)","v":0},{"$f":"IF(SUMPRODUCT($H$48:BE$48,$H4:BE4)<0.5, \"Pending\", IF(BE4<0.5, \"Complete\", \"In Progress\"))","v":"Pending"},0,{"$f":"MAX(BE4-BG4,0)","v":0},{"$f":"IF(SUMPRODUCT($H$48:BH$48,$H4:BH4)<0.5, \"Pending\", IF(BH4<0.5, \"Complete\", \"In Progress\"))","v":"Pending"},0,{"$f":"MAX(BH4-BJ4,0)","v":0},{"$f":"IF(SUMPRODUCT($H$48:BK$48,$H4:BK4)<0.5, \"Pending\", IF(BK4<0.5, \"Complete\", \"In Progress\"))","v":"Pending"},0,{"$f":"MAX(BK4-BM4,0)","v":0},{"$f":"IF(SUMPRODUCT($H$48:BN$48,$H4:BN4)<0.5, \"Pending\", IF(BN4<0.5, \"Complete\", \"In Progress\"))","v":"Pending"},0,{"$f":"MAX(BN4-BP4,0)","v":0},{"$f":"IF(SUMPRODUCT($H$48:BQ$48,$H4:BQ4)<0.5, \"Pending\", IF(BQ4<0.5, \"Complete\", \"In Progress\"))","v":"Pending"},0,{"$f":"MAX(BQ4-BS4,0)","v":0},{"$f":"IF(SUMPRODUCT($H$48:BT$48,$H4:BT4)<0.5, \"Pending\", IF(BT4<0.5, \"Complete\", \"In Progress\"))","v":"Pending"},0,{"$f":"MAX(BT4-BV4,0)","v":0},{"$f":"IF(SUMPRODUCT($H$48:BW$48,$H4:BW4)<0.5, \"Pending\", IF(BW4<0.5, \"Complete\", \"In Progress\"))","v":"Pending"},0,{"$f":"MAX(BW4-BY4,0)","v":0},{"$f":"IF(SUMPRODUCT($H$48:BZ$48,$H4:BZ4)<0.5, \"Pending\", IF(BZ4<0.5, \"Complete\", \"In Progress\"))","v":"Pending"},0,{"$f":"MAX(BZ4-CB4,0)","v":0},{"$f":"IF(SUMPRODUCT($H$48:CC$48,$H4:CC4)<0.5, \"Pending\", IF(CC4<0.5, \"Complete\", \"In Progress\"))","v":"Pending"},0,{"$f":"MAX(CC4-CE4,0)","v":0},{"$f":"IF(SUMPRODUCT($H$48:CF$48,$H4:CF4)<0.5, \"Pending\", IF(CF4<0.5, \"Complete\", \"In Progress\"))","v":"Pending"},0,{"$f":"MAX(CF4-CH4,0)","v":0},{"$f":"IF(SUMPRODUCT($H$48:CI$48,$H4:CI4)<0.5, \"Pending\", IF(CI4<0.5, \"Complete\", \"In Progress\"))","v":"Pending"},0,{"$f":"MAX(CI4-CK4,0)","v":0},{"$f":"IF(SUMPRODUCT($H$48:CL$48,$H4:CL4)<0.5, \"Pending\", IF(CL4<0.5, \"Complete\", \"In Progress\"))","v":"Pending"},0,{"$f":"MAX(CL4-CN4,0)","v":0},{"$f":"IF(SUMPRODUCT($H$48:CO$48,$H4:CO4)<0.5, \"Pending\", IF(CO4<0.5, \"Complete\", \"In Progress\"))","v":"Pending"},0,{"$f":"MAX(CO4-CQ4,0)","v":0},{"$f":"IF(SUMPRODUCT($H$48:CR$48,$H4:CR4)<0.5, \"Pending\", IF(CR4<0.5, \"Complete\", \"In Progress\"))","v":"Pending"},0,{"$f":"MAX(CR4-CT4,0)","v":0},{"$f":"IF(SUMPRODUCT($H$48:CU$48,$H4:CU4)<0.5, \"Pending\", IF(CU4<0.5, \"Complete\", \"In Progress\"))","v":"Pending"},0,{"$f":"MAX(CU4-CW4,0)","v":0},{"$f":"IF(SUMPRODUCT($H$48:CX$48,$H4:CX4)<0.5, \"Pending\", IF(CX4<0.5, \"Complete\", \"In Progress\"))","v":"Pending"},0,{"$f":"MAX(CX4-CZ4,0)","v":0},{"$f":"IF(SUMPRODUCT($H$48:DA$48,$H4:DA4)<0.5, \"Pending\", IF(DA4<0.5, \"Complete\", \"In Progress\"))","v":"Pending"},0,{"$f":"MAX(DA4-DC4,0)","v":0},{"$f":"IF(SUMPRODUCT($H$48:DD$48,$H4:DD4)<0.5, \"Pending\", IF(DD4<0.5, \"Complete\", \"In Progress\"))","v":"Pending"},0,{"$f":"MAX(DD4-DF4,0)","v":0},{"$f":"IF(SUMPRODUCT($H$48:DG$48,$H4:DG4)<0.5, \"Pending\", IF(DG4<0.5, \"Complete\", \"In Progress\"))","v":"Pending"},0,{"$f":"MAX(DG4-DI4,0)","v":0},{"$f":"IF(SUMPRODUCT($H$48:DJ$48,$H4:DJ4)<0.5, \"Pending\", IF(DJ4<0.5, \"Complete\", \"In Progress\"))","v":"Pending"},0,{"$f":"MAX(DJ4-DL4,0)","v":0},{"$f":"IF(SUMPRODUCT($H$48:DM$48,$H4:DM4)<0.5, \"Pending\", IF(DM4<0.5, \"Complete\", \"In Progress\"))","v":"Pending"},0,{"$f":"MAX(DM4-DO4,0)","v":0},{"$f":"IF(SUMPRODUCT($H$48:DP$48,$H4:DP4)<0.5, \"Pending\", IF(DP4<0.5, \"Complete\", \"In Progress\"))","v":"Pending"},0,{"$f":"MAX(DP4-DR4,0)","v":0},{"$f":"IF(SUMPRODUCT($H$48:DS$48,$H4:DS4)<0.5, \"Pending\", IF(DS4<0.5, \"Complete\", \"In Progress\"))","v":"Pending"},0,{"$f":"MAX(DS4-DU4,0)","v":0},{"$f":"IF(SUMPRODUCT($H$48:DV$48,$H4:DV4)<0.5, \"Pending\", IF(DV4<0.5, \"Complete\", \"In Progress\"))","v":"Pending"},null,{"$f":"SUMPRODUCT($F$48:DE$48,$F4:DE4)","v":0}]
[null,null,"Update Website","dave@althris.com","In Progress",6,8,4,{"$f":"MAX(G5-H5, 0)","v":4},{"$f":"IF(SUMPRODUCT($H$48:I$48,$H5:I5)<0.5, \"Pending\", IF(I5<0.5, \"Complete\", \"In Progress\"))","v":"In Progress"},0,{"$f":"MAX(I5-K5,0)","v":4},{"$f":"IF(SUMPRODUCT($H$48:L$48,$H5:L5)<0.5, \"Pending\", IF(L5<0.5, \"Complete\", \"In Progress\"))","v":"In Progress"},0,{"$f":"MAX(L5-N5,0)","v":4},{"$f":"IF(SUMPRODUCT($H$48:O$48,$H5:O5)<0.5, \"Pending\", IF(O5<0.5, \"Complete\", \"In Progress\"))","v":"In Progress"},0,{"$f":"MAX(O5-Q5,0)","v":4},{"$f":"IF(SUMPRODUCT($H$48:R$48,$H5:R5)<0.5, \"Pending\", IF(R5<0.5, \"Complete\", \"In Progress\"))","v":"In Progress"},0,{"$f":"MAX(R5-T5,0)","v":4},{"$f":"IF(SUMPRODUCT($H$48:U$48,$H5:U5)<0.5, \"Pending\", IF(U5<0.5, \"Complete\", \"In Progress\"))","v":"In Progress"},0,{"$f":"MAX(U5-W5,0)","v":4},{"$f":"IF(SUMPRODUCT($H$48:X$48,$H5:X5)<0.5, \"Pending\", IF(X5<0.5, \"Complete\", \"In Progress\"))","v":"In Progress"},0,{"$f":"MAX(X5-Z5,0)","v":4},{"$f":"IF(SUMPRODUCT($H$48:AA$48,$H5:AA5)<0.5, \"Pending\", IF(AA5<0.5, \"Complete\", \"In Progress\"))","v":"In Progress"},0,{"$f":"MAX(AA5-AC5,0)","v":4},{"$f":"IF(SUMPRODUCT($H$48:AD$48,$H5:AD5)<0.5, \"Pending\", IF(AD5<0.5, \"Complete\", \"In Progress\"))","v":"In Progress"},0,{"$f":"MAX(AD5-AF5,0)","v":4},{"$f":"IF(SUMPRODUCT($H$48:AG$48,$H5:AG5)<0.5, \"Pending\", IF(AG5<0.5, \"Complete\", \"In Progress\"))","v":"In Progress"},0,{"$f":"MAX(AG5-AI5,0)","v":4},{"$f":"IF(SUMPRODUCT($H$48:AJ$48,$H5:AJ5)<0.5, \"Pending\", IF(AJ5<0.5, \"Complete\", \"In Progress\"))","v":"In Progress"},0,{"$f":"MAX(AJ5-AL5,0)","v":4},{"$f":"IF(SUMPRODUCT($H$48:AM$48,$H5:AM5)<0.5, \"Pending\", IF(AM5<0.5, \"Complete\", \"In Progress\"))","v":"In Progress"},0,{"$f":"MAX(AM5-AO5,0)","v":4},{"$f":"IF(SUMPRODUCT($H$48:AP$48,$H5:AP5)<0.5, \"Pending\", IF(AP5<0.5, \"Complete\", \"In Progress\"))","v":"In Progress"},0,{"$f":"MAX(AP5-AR5,0)","v":4},{"$f":"IF(SUMPRODUCT($H$48:AS$48,$H5:AS5)<0.5, \"Pending\", IF(AS5<0.5, \"Complete\", \"In Progress\"))","v":"In Progress"},0,{"$f":"MAX(AS5-AU5,0)","v":4},{"$f":"IF(SUMPRODUCT($H$48:AV$48,$H5:AV5)<0.5, \"Pending\", IF(AV5<0.5, \"Complete\", \"In Progress\"))","v":"In Progress"},0,{"$f":"MAX(AV5-AX5,0)","v":4},{"$f":"IF(SUMPRODUCT($H$48:AY$48,$H5:AY5)<0.5, \"Pending\", IF(AY5<0.5, \"Complete\", \"In Progress\"))","v":"In Progress"},0,{"$f":"MAX(AY5-BA5,0)","v":4},{"$f":"IF(SUMPRODUCT($H$48:BB$48,$H5:BB5)<0.5, \"Pending\", IF(BB5<0.5, \"Complete\", \"In Progress\"))","v":"In Progress"},0,{"$f":"MAX(BB5-BD5,0)","v":4},{"$f":"IF(SUMPRODUCT($H$48:BE$48,$H5:BE5)<0.5, \"Pending\", IF(BE5<0.5, \"Complete\", \"In Progress\"))","v":"In Progress"},0,{"$f":"MAX(BE5-BG5,0)","v":4},{"$f":"IF(SUMPRODUCT($H$48:BH$48,$H5:BH5)<0.5, \"Pending\", IF(BH5<0.5, \"Complete\", \"In Progress\"))","v":"In Progress"},0,{"$f":"MAX(BH5-BJ5,0)","v":4},{"$f":"IF(SUMPRODUCT($H$48:BK$48,$H5:BK5)<0.5, \"Pending\", IF(BK5<0.5, \"Complete\", \"In Progress\"))","v":"In Progress"},0,{"$f":"MAX(BK5-BM5,0)","v":4},{"$f":"IF(SUMPRODUCT($H$48:BN$48,$H5:BN5)<0.5, \"Pending\", IF(BN5<0.5, \"Complete\", \"In Progress\"))","v":"In Progress"},0,{"$f":"MAX(BN5-BP5,0)","v":4},{"$f":"IF(SUMPRODUCT($H$48:BQ$48,$H5:BQ5)<0.5, \"Pending\", IF(BQ5<0.5, \"Complete\", \"In Progress\"))","v":"In Progress"},0,{"$f":"MAX(BQ5-BS5,0)","v":4},{"$f":"IF(SUMPRODUCT($H$48:BT$48,$H5:BT5)<0.5, \"Pending\", IF(BT5<0.5, \"Complete\", \"In Progress\"))","v":"In Progress"},0,{"$f":"MAX(BT5-BV5,0)","v":4},{"$f":"IF(SUMPRODUCT($H$48:BW$48,$H5:BW5)<0.5, \"Pending\", IF(BW5<0.5, \"Complete\", \"In Progress\"))","v":"In Progress"},0,{"$f":"MAX(BW5-BY5,0)","v":4},{"$f":"IF(SUMPRODUCT($H$48:BZ$48,$H5:BZ5)<0.5, \"Pending\", IF(BZ5<0.5, \"Complete\", \"In Progress\"))","v":"In Progress"},0,{"$f":"MAX(BZ5-CB5,0)","v":4},{"$f":"IF(SUMPRODUCT($H$48:CC$48,$H5:CC5)<0.5, \"Pending\", IF(CC5<0.5, \"Complete\", \"In Progress\"))","v":"In Progress"},0,{"$f":"MAX(CC5-CE5,0)","v":4},{"$f":"IF(SUMPRODUCT($H$48:CF$48,$H5:CF5)<0.5, \"Pending\", IF(CF5<0.5, \"Complete\", \"In Progress\"))","v":"In Progress"},0,{"$f":"MAX(CF5-CH5,0)","v":4},{"$f":"IF(SUMPRODUCT($H$48:CI$48,$H5:CI5)<0.5, \"Pending\", IF(CI5<0.5, \"Complete\", \"In Progress\"))","v":"In Progress"},0,{"$f":"MAX(CI5-CK5,0)","v":4},{"$f":"IF(SUMPRODUCT($H$48:CL$48,$H5:CL5)<0.5, \"Pending\", IF(CL5<0.5, \"Complete\", \"In Progress\"))","v":"In Progress"},0,{"$f":"MAX(CL5-CN5,0)","v":4},{"$f":"IF(SUMPRODUCT($H$48:CO$48,$H5:CO5)<0.5, \"Pending\", IF(CO5<0.5, \"Complete\", \"In Progress\"))","v":"In Progress"},0,{"$f":"MAX(CO5-CQ5,0)","v":4},{"$f":"IF(SUMPRODUCT($H$48:CR$48,$H5:CR5)<0.5, \"Pending\", IF(CR5<0.5, \"Complete\", \"In Progress\"))","v":"In Progress"},0,4,{"$f":"IF(SUMPRODUCT($H$48:CU$48,$H5:CU5)<0.5, \"Pending\", IF(CU5<0.5, \"Complete\", \"In Progress\"))","v":"In Progress"},0,4,{"$f":"IF(SUMPRODUCT($H$48:CX$48,$H5:CX5)<0.5, \"Pending\", IF(CX5<0.5, \"Complete\", \"In Progress\"))","v":"In Progress"},0,4,{"$f":"IF(SUMPRODUCT($H$48:DA$48,$H5:DA5)<0.5, \"Pending\", IF(DA5<0.5, \"Complete\", \"In Progress\"))","v":"In Progress"},0,4,{"$f":"IF(SUMPRODUCT($H$48:DD$48,$H5:DD5)<0.5, \"Pending\", IF(DD5<0.5, \"Complete\", \"In Progress\"))","v":"In Progress"},0,4,{"$f":"IF(SUMPRODUCT($H$48:DG$48,$H5:DG5)<0.5, \"Pending\", IF(DG5<0.5, \"Complete\", \"In Progress\"))","v":"In Progress"},0,4,{"$f":"IF(SUMPRODUCT($H$48:DJ$48,$H5:DJ5)<0.5, \"Pending\", IF(DJ5<0.5, \"Complete\", \"In Progress\"))","v":"In Progress"},0,4,{"$f":"IF(SUMPRODUCT($H$48:DM$48,$H5:DM5)<0.5, \"Pending\", IF(DM5<0.5, \"Complete\", \"In Progress\"))","v":"In Progress"},0,4,{"$f":"IF(SUMPRODUCT($H$48:DP$48,$H5:DP5)<0.5, \"Pending\", IF(DP5<0.5, \"Complete\", \"In Progress\"))","v":"In Progress"},0,4,{"$f":"IF(SUMPRODUCT($H$48:DS$48,$H5:DS5)<0.5, \"Pending\", IF(DS5<0.5, \"Complete\", \"In Progress\"))","v":"In Progress"},0,4,{"$f":"IF(SUMPRODUCT($H$48:DV$48,$H5:DV5)<0.5, \"Pending\", IF(DV5<0.5, \"Complete\", \"In Progress\"))","v":"In Progress"},null,{"$f":"SUMPRODUCT($F$48:DE$48,$F5:DE5)","v":4}]
[null,null,"Review PSM Sample Paper ","dave@althris.com","In Progress",1,4,1,3,{"$f":"IF(SUMPRODUCT($H$48:I$48,$H6:I6)<0.5, \"Pending\", IF(I6<0.5, \"Complete\", \"In Progress\"))","v":"In Progress"},1,2,{"$f":"IF(SUMPRODUCT($H$48:L$48,$H6:L6)<0.5, \"Pending\", IF(L6<0.5, \"Complete\", \"In Progress\"))","v":"In Progress"},1,1,{"$f":"IF(SUMPRODUCT($H$48:O$48,$H6:O6)<0.5, \"Pending\", IF(O6<0.5, \"Complete\", \"In Progress\"))","v":"In Progress"},0,1,{"$f":"IF(SUMPRODUCT($H$48:R$48,$H6:R6)<0.5, \"Pending\", IF(R6<0.5, \"Complete\", \"In Progress\"))","v":"In Progress"},0,1,{"$f":"IF(SUMPRODUCT($H$48:U$48,$H6:U6)<0.5, \"Pending\", IF(U6<0.5, \"Complete\", \"In Progress\"))","v":"In Progress"},0,1,{"$f":"IF(SUMPRODUCT($H$48:X$48,$H6:X6)<0.5, \"Pending\", IF(X6<0.5, \"Complete\", \"In Progress\"))","v":"In Progress"},0,1,{"$f":"IF(SUMPRODUCT($H$48:AA$48,$H6:AA6)<0.5, \"Pending\", IF(AA6<0.5, \"Complete\", \"In Progress\"))","v":"In Progress"},0,1,{"$f":"IF(SUMPRODUCT($H$48:AD$48,$H6:AD6)<0.5, \"Pending\", IF(AD6<0.5, \"Complete\", \"In Progress\"))","v":"In Progress"},0,1,{"$f":"IF(SUMPRODUCT($H$48:AG$48,$H6:AG6)<0.5, \"Pending\", IF(AG6<0.5, \"Complete\", \"In Progress\"))","v":"In Progress"},0,1,{"$f":"IF(SUMPRODUCT($H$48:AJ$48,$H6:AJ6)<0.5, \"Pending\", IF(AJ6<0.5, \"Complete\", \"In Progress\"))","v":"In Progress"},0,1,{"$f":"IF(SUMPRODUCT($H$48:AM$48,$H6:AM6)<0.5, \"Pending\", IF(AM6<0.5, \"Complete\", \"In Progress\"))","v":"In Progress"},0,1,{"$f":"IF(SUMPRODUCT($H$48:AP$48,$H6:AP6)<0.5, \"Pending\", IF(AP6<0.5, \"Complete\", \"In Progress\"))","v":"In Progress"},0,1,{"$f":"IF(SUMPRODUCT($H$48:AS$48,$H6:AS6)<0.5, \"Pending\", IF(AS6<0.5, \"Complete\", \"In Progress\"))","v":"In Progress"},0,1,{"$f":"IF(SUMPRODUCT($H$48:AV$48,$H6:AV6)<0.5, \"Pending\", IF(AV6<0.5, \"Complete\", \"In Progress\"))","v":"In Progress"},0,1,{"$f":"IF(SUMPRODUCT($H$48:AY$48,$H6:AY6)<0.5, \"Pending\", IF(AY6<0.5, \"Complete\", \"In Progress\"))","v":"In Progress"},0,1,{"$f":"IF(SUMPRODUCT($H$48:BB$48,$H6:BB6)<0.5, \"Pending\", IF(BB6<0.5, \"Complete\", \"In Progress\"))","v":"In Progress"},0,1,{"$f":"IF(SUMPRODUCT($H$48:BE$48,$H6:BE6)<0.5, \"Pending\", IF(BE6<0.5, \"Complete\", \"In Progress\"))","v":"In Progress"},0,1,{"$f":"IF(SUMPRODUCT($H$48:BH$48,$H6:BH6)<0.5, \"Pending\", IF(BH6<0.5, \"Complete\", \"In Progress\"))","v":"In Progress"},0,1,{"$f":"IF(SUMPRODUCT($H$48:BK$48,$H6:BK6)<0.5, \"Pending\", IF(BK6<0.5, \"Complete\", \"In Progress\"))","v":"In Progress"},0,1,{"$f":"IF(SUMPRODUCT($H$48:BN$48,$H6:BN6)<0.5, \"Pending\", IF(BN6<0.5, \"Complete\", \"In Progress\"))","v":"In Progress"},0,1,{"$f":"IF(SUMPRODUCT($H$48:BQ$48,$H6:BQ6)<0.5, \"Pending\", IF(BQ6<0.5, \"Complete\", \"In Progress\"))","v":"In Progress"},0,1,{"$f":"IF(SUMPRODUCT($H$48:BT$48,$H6:BT6)<0.5, \"Pending\", IF(BT6<0.5, \"Complete\", \"In Progress\"))","v":"In Progress"},0,1,{"$f":"IF(SUMPRODUCT($H$48:BW$48,$H6:BW6)<0.5, \"Pending\", IF(BW6<0.5, \"Complete\", \"In Progress\"))","v":"In Progress"},0,1,{"$f":"IF(SUMPRODUCT($H$48:BZ$48,$H6:BZ6)<0.5, \"Pending\", IF(BZ6<0.5, \"Complete\", \"In Progress\"))","v":"In Progress"},0,1,{"$f":"IF(SUMPRODUCT($H$48:CC$48,$H6:CC6)<0.5, \"Pending\", IF(CC6<0.5, \"Complete\", \"In Progress\"))","v":"In Progress"},0,1,{"$f":"IF(SUMPRODUCT($H$48:CF$48,$H6:CF6)<0.5, \"Pending\", IF(CF6<0.5, \"Complete\", \"In Progress\"))","v":"In Progress"},0,1,{"$f":"IF(SUMPRODUCT($H$48:CI$48,$H6:CI6)<0.5, \"Pending\", IF(CI6<0.5, \"Complete\", \"In Progress\"))","v":"In Progress"},0,1,{"$f":"IF(SUMPRODUCT($H$48:CL$48,$H6:CL6)<0.5, \"Pending\", IF(CL6<0.5, \"Complete\", \"In Progress\"))","v":"In Progress"},0,1,{"$f":"IF(SUMPRODUCT($H$48:CO$48,$H6:CO6)<0.5, \"Pending\", IF(CO6<0.5, \"Complete\", \"In Progress\"))","v":"In Progress"},0,1,{"$f":"IF(SUMPRODUCT($H$48:CR$48,$H6:CR6)<0.5, \"Pending\", IF(CR6<0.5, \"Complete\", \"In Progress\"))","v":"In Progress"},0,1,{"$f":"IF(SUMPRODUCT($H$48:CU$48,$H6:CU6)<0.5, \"Pending\", IF(CU6<0.5, \"Complete\", \"In Progress\"))","v":"In Progress"},0,1,{"$f":"IF(SUMPRODUCT($H$48:CX$48,$H6:CX6)<0.5, \"Pending\", IF(CX6<0.5, \"Complete\", \"In Progress\"))","v":"In Progress"},0,1,{"$f":"IF(SUMPRODUCT($H$48:DA$48,$H6:DA6)<0.5, \"Pending\", IF(DA6<0.5, \"Complete\", \"In Progress\"))","v":"In Progress"},0,1,{"$f":"IF(SUMPRODUCT($H$48:DD$48,$H6:DD6)<0.5, \"Pending\", IF(DD6<0.5, \"Complete\", \"In Progress\"))","v":"In Progress"},0,1,{"$f":"IF(SUMPRODUCT($H$48:DG$48,$H6:DG6)<0.5, \"Pending\", IF(DG6<0.5, \"Complete\", \"In Progress\"))","v":"In Progress"},0,1,{"$f":"IF(SUMPRODUCT($H$48:DJ$48,$H6:DJ6)<0.5, \"Pending\", IF(DJ6<0.5, \"Complete\", \"In Progress\"))","v":"In Progress"},0,1,{"$f":"IF(SUMPRODUCT($H$48:DM$48,$H6:DM6)<0.5, \"Pending\", IF(DM6<0.5, \"Complete\", \"In Progress\"))","v":"In Progress"},0,1,{"$f":"IF(SUMPRODUCT($H$48:DP$48,$H6:DP6)<0.5, \"Pending\", IF(DP6<0.5, \"Complete\", \"In Progress\"))","v":"In Progress"},0,1,{"$f":"IF(SUMPRODUCT($H$48:DS$48,$H6:DS6)<0.5, \"Pending\", IF(DS6<0.5, \"Complete\", \"In Progress\"))","v":"In Progress"},0,1,{"$f":"IF(SUMPRODUCT($H$48:DV$48,$H6:DV6)<0.5, \"Pending\", IF(DV6<0.5, \"Complete\", \"In Progress\"))","v":"In Progress"},null,{"$f":"SUMPRODUCT($F$48:DE$48,$F6:DE6)","v":3}]
[null,null,"Update Scrum Gathering Dublin Presentation ","dave@althris.com","Pending",1,4,0,4,{"$f":"IF(SUMPRODUCT($H$48:I$48,$H7:I7)<0.5, \"Pending\", IF(I7<0.5, \"Complete\", \"In Progress\"))","v":"Pending"},0,4,{"$f":"IF(SUMPRODUCT($H$48:L$48,$H7:L7)<0.5, \"Pending\", IF(L7<0.5, \"Complete\", \"In Progress\"))","v":"Pending"},0,4,{"$f":"IF(SUMPRODUCT($H$48:O$48,$H7:O7)<0.5, \"Pending\", IF(O7<0.5, \"Complete\", \"In Progress\"))","v":"Pending"},0,4,{"$f":"IF(SUMPRODUCT($H$48:R$48,$H7:R7)<0.5, \"Pending\", IF(R7<0.5, \"Complete\", \"In Progress\"))","v":"Pending"},0,4,{"$f":"IF(SUMPRODUCT($H$48:U$48,$H7:U7)<0.5, \"Pending\", IF(U7<0.5, \"Complete\", \"In Progress\"))","v":"Pending"},0,4,{"$f":"IF(SUMPRODUCT($H$48:X$48,$H7:X7)<0.5, \"Pending\", IF(X7<0.5, \"Complete\", \"In Progress\"))","v":"Pending"},0,4,{"$f":"IF(SUMPRODUCT($H$48:AA$48,$H7:AA7)<0.5, \"Pending\", IF(AA7<0.5, \"Complete\", \"In Progress\"))","v":"Pending"},0,4,{"$f":"IF(SUMPRODUCT($H$48:AD$48,$H7:AD7)<0.5, \"Pending\", IF(AD7<0.5, \"Complete\", \"In Progress\"))","v":"Pending"},0,4,{"$f":"IF(SUMPRODUCT($H$48:AG$48,$H7:AG7)<0.5, \"Pending\", IF(AG7<0.5, \"Complete\", \"In Progress\"))","v":"Pending"},0,4,{"$f":"IF(SUMPRODUCT($H$48:AJ$48,$H7:AJ7)<0.5, \"Pending\", IF(AJ7<0.5, \"Complete\", \"In Progress\"))","v":"Pending"},0,4,{"$f":"IF(SUMPRODUCT($H$48:AM$48,$H7:AM7)<0.5, \"Pending\", IF(AM7<0.5, \"Complete\", \"In Progress\"))","v":"Pending"},0,4,{"$f":"IF(SUMPRODUCT($H$48:AP$48,$H7:AP7)<0.5, \"Pending\", IF(AP7<0.5, \"Complete\", \"In Progress\"))","v":"Pending"},0,4,{"$f":"IF(SUMPRODUCT($H$48:AS$48,$H7:AS7)<0.5, \"Pending\", IF(AS7<0.5, \"Complete\", \"In Progress\"))","v":"Pending"},0,4,{"$f":"IF(SUMPRODUCT($H$48:AV$48,$H7:AV7)<0.5, \"Pending\", IF(AV7<0.5, \"Complete\", \"In Progress\"))","v":"Pending"},0,4,{"$f":"IF(SUMPRODUCT($H$48:AY$48,$H7:AY7)<0.5, \"Pending\", IF(AY7<0.5, \"Complete\", \"In Progress\"))","v":"Pending"},0,4,{"$f":"IF(SUMPRODUCT($H$48:BB$48,$H7:BB7)<0.5, \"Pending\", IF(BB7<0.5, \"Complete\", \"In Progress\"))","v":"Pending"},0,4,{"$f":"IF(SUMPRODUCT($H$48:BE$48,$H7:BE7)<0.5, \"Pending\", IF(BE7<0.5, \"Complete\", \"In Progress\"))","v":"Pending"},0,4,{"$f":"IF(SUMPRODUCT($H$48:BH$48,$H7:BH7)<0.5, \"Pending\", IF(BH7<0.5, \"Complete\", \"In Progress\"))","v":"Pending"},0,4,{"$f":"IF(SUMPRODUCT($H$48:BK$48,$H7:BK7)<0.5, \"Pending\", IF(BK7<0.5, \"Complete\", \"In Progress\"))","v":"Pending"},0,4,{"$f":"IF(SUMPRODUCT($H$48:BN$48,$H7:BN7)<0.5, \"Pending\", IF(BN7<0.5, \"Complete\", \"In Progress\"))","v":"Pending"},0,4,{"$f":"IF(SUMPRODUCT($H$48:BQ$48,$H7:BQ7)<0.5, \"Pending\", IF(BQ7<0.5, \"Complete\", \"In Progress\"))","v":"Pending"},0,4,{"$f":"IF(SUMPRODUCT($H$48:BT$48,$H7:BT7)<0.5, \"Pending\", IF(BT7<0.5, \"Complete\", \"In Progress\"))","v":"Pending"},0,4,{"$f":"IF(SUMPRODUCT($H$48:BW$48,$H7:BW7)<0.5, \"Pending\", IF(BW7<0.5, \"Complete\", \"In Progress\"))","v":"Pending"},0,4,{"$f":"IF(SUMPRODUCT($H$48:BZ$48,$H7:BZ7)<0.5, \"Pending\", IF(BZ7<0.5, \"Complete\", \"In Progress\"))","v":"Pending"},0,4,{"$f":"IF(SUMPRODUCT($H$48:CC$48,$H7:CC7)<0.5, \"Pending\", IF(CC7<0.5, \"Complete\", \"In Progress\"))","v":"Pending"},0,4,{"$f":"IF(SUMPRODUCT($H$48:CF$48,$H7:CF7)<0.5, \"Pending\", IF(CF7<0.5, \"Complete\", \"In Progress\"))","v":"Pending"},0,4,{"$f":"IF(SUMPRODUCT($H$48:CI$48,$H7:CI7)<0.5, \"Pending\", IF(CI7<0.5, \"Complete\", \"In Progress\"))","v":"Pending"},0,4,{"$f":"IF(SUMPRODUCT($H$48:CL$48,$H7:CL7)<0.5, \"Pending\", IF(CL7<0.5, \"Complete\", \"In Progress\"))","v":"Pending"},0,4,{"$f":"IF(SUMPRODUCT($H$48:CO$48,$H7:CO7)<0.5, \"Pending\", IF(CO7<0.5, \"Complete\", \"In Progress\"))","v":"Pending"},0,4,{"$f":"IF(SUMPRODUCT($H$48:CR$48,$H7:CR7)<0.5, \"Pending\", IF(CR7<0.5, \"Complete\", \"In Progress\"))","v":"Pending"},0,4,{"$f":"IF(SUMPRODUCT($H$48:CU$48,$H7:CU7)<0.5, \"Pending\", IF(CU7<0.5, \"Complete\", \"In Progress\"))","v":"Pending"},0,4,{"$f":"IF(SUMPRODUCT($H$48:CX$48,$H7:CX7)<0.5, \"Pending\", IF(CX7<0.5, \"Complete\", \"In Progress\"))","v":"Pending"},0,4,{"$f":"IF(SUMPRODUCT($H$48:DA$48,$H7:DA7)<0.5, \"Pending\", IF(DA7<0.5, \"Complete\", \"In Progress\"))","v":"Pending"},0,4,{"$f":"IF(SUMPRODUCT($H$48:DD$48,$H7:DD7)<0.5, \"Pending\", IF(DD7<0.5, \"Complete\", \"In Progress\"))","v":"Pending"},0,4,{"$f":"IF(SUMPRODUCT($H$48:DG$48,$H7:DG7)<0.5, \"Pending\", IF(DG7<0.5, \"Complete\", \"In Progress\"))","v":"Pending"},0,4,{"$f":"IF(SUMPRODUCT($H$48:DJ$48,$H7:DJ7)<0.5, \"Pending\", IF(DJ7<0.5, \"Complete\", \"In Progress\"))","v":"Pending"},0,4,{"$f":"IF(SUMPRODUCT($H$48:DM$48,$H7:DM7)<0.5, \"Pending\", IF(DM7<0.5, \"Complete\", \"In Progress\"))","v":"Pending"},0,4,{"$f":"IF(SUMPRODUCT($H$48:DP$48,$H7:DP7)<0.5, \"Pending\", IF(DP7<0.5, \"Complete\", \"In Progress\"))","v":"Pending"},0,4,{"$f":"IF(SUMPRODUCT($H$48:DS$48,$H7:DS7)<0.5, \"Pending\", IF(DS7<0.5, \"Complete\", \"In Progress\"))","v":"Pending"},0,4,{"$f":"IF(SUMPRODUCT($H$48:DV$48,$H7:DV7)<0.5, \"Pending\", IF(DV7<0.5, \"Complete\", \"In Progress\"))","v":"Pending"},null,{"$f":"SUMPRODUCT($F$48:DE$48,$F7:DE7)","v":0}]
[null,null,null,"unassigned","Pending",1,0,0,0,{"$f":"IF(SUMPRODUCT($H$48:I$48,$H8:I8)<0.5, \"Pending\", IF(I8<0.5, \"Complete\", \"In Progress\"))","v":"Pending"},0,0,{"$f":"IF(SUMPRODUCT($H$48:L$48,$H8:L8)<0.5, \"Pending\", IF(L8<0.5, \"Complete\", \"In Progress\"))","v":"Pending"},0,0,{"$f":"IF(SUMPRODUCT($H$48:O$48,$H8:O8)<0.5, \"Pending\", IF(O8<0.5, \"Complete\", \"In Progress\"))","v":"Pending"},0,0,{"$f":"IF(SUMPRODUCT($H$48:R$48,$H8:R8)<0.5, \"Pending\", IF(R8<0.5, \"Complete\", \"In Progress\"))","v":"Pending"},0,0,{"$f":"IF(SUMPRODUCT($H$48:U$48,$H8:U8)<0.5, \"Pending\", IF(U8<0.5, \"Complete\", \"In Progress\"))","v":"Pending"},0,0,{"$f":"IF(SUMPRODUCT($H$48:X$48,$H8:X8)<0.5, \"Pending\", IF(X8<0.5, \"Complete\", \"In Progress\"))","v":"Pending"},0,0,{"$f":"IF(SUMPRODUCT($H$48:AA$48,$H8:AA8)<0.5, \"Pending\", IF(AA8<0.5, \"Complete\", \"In Progress\"))","v":"Pending"},0,0,{"$f":"IF(SUMPRODUCT($H$48:AD$48,$H8:AD8)<0.5, \"Pending\", IF(AD8<0.5, \"Complete\", \"In Progress\"))","v":"Pending"},0,0,{"$f":"IF(SUMPRODUCT($H$48:AG$48,$H8:AG8)<0.5, \"Pending\", IF(AG8<0.5, \"Complete\", \"In Progress\"))","v":"Pending"},0,0,{"$f":"IF(SUMPRODUCT($H$48:AJ$48,$H8:AJ8)<0.5, \"Pending\", IF(AJ8<0.5, \"Complete\", \"In Progress\"))","v":"Pending"},0,0,{"$f":"IF(SUMPRODUCT($H$48:AM$48,$H8:AM8)<0.5, \"Pending\", IF(AM8<0.5, \"Complete\", \"In Progress\"))","v":"Pending"},0,0,{"$f":"IF(SUMPRODUCT($H$48:AP$48,$H8:AP8)<0.5, \"Pending\", IF(AP8<0.5, \"Complete\", \"In Progress\"))","v":"Pending"},0,0,{"$f":"IF(SUMPRODUCT($H$48:AS$48,$H8:AS8)<0.5, \"Pending\", IF(AS8<0.5, \"Complete\", \"In Progress\"))","v":"Pending"},0,0,{"$f":"IF(SUMPRODUCT($H$48:AV$48,$H8:AV8)<0.5, \"Pending\", IF(AV8<0.5, \"Complete\", \"In Progress\"))","v":"Pending"},0,0,{"$f":"IF(SUMPRODUCT($H$48:AY$48,$H8:AY8)<0.5, \"Pending\", IF(AY8<0.5, \"Complete\", \"In Progress\"))","v":"Pending"},0,0,{"$f":"IF(SUMPRODUCT($H$48:BB$48,$H8:BB8)<0.5, \"Pending\", IF(BB8<0.5, \"Complete\", \"In Progress\"))","v":"Pending"},0,0,{"$f":"IF(SUMPRODUCT($H$48:BE$48,$H8:BE8)<0.5, \"Pending\", IF(BE8<0.5, \"Complete\", \"In Progress\"))","v":"Pending"},0,0,{"$f":"IF(SUMPRODUCT($H$48:BH$48,$H8:BH8)<0.5, \"Pending\", IF(BH8<0.5, \"Complete\", \"In Progress\"))","v":"Pending"},0,0,{"$f":"IF(SUMPRODUCT($H$48:BK$48,$H8:BK8)<0.5, \"Pending\", IF(BK8<0.5, \"Complete\", \"In Progress\"))","v":"Pending"},0,0,{"$f":"IF(SUMPRODUCT($H$48:BN$48,$H8:BN8)<0.5, \"Pending\", IF(BN8<0.5, \"Complete\", \"In Progress\"))","v":"Pending"},0,0,{"$f":"IF(SUMPRODUCT($H$48:BQ$48,$H8:BQ8)<0.5, \"Pending\", IF(BQ8<0.5, \"Complete\", \"In Progress\"))","v":"Pending"},0,0,{"$f":"IF(SUMPRODUCT($H$48:BT$48,$H8:BT8)<0.5, \"Pending\", IF(BT8<0.5, \"Complete\", \"In Progress\"))","v":"Pending"},0,0,{"$f":"IF(SUMPRODUCT($H$48:BW$48,$H8:BW8)<0.5, \"Pending\", IF(BW8<0.5, \"Complete\", \"In Progress\"))","v":"Pending"},0,0,{"$f":"IF(SUMPRODUCT($H$48:BZ$48,$H8:BZ8)<0.5, \"Pending\", IF(BZ8<0.5, \"Complete\", \"In Progress\"))","v":"Pending"},0,0,{"$f":"IF(SUMPRODUCT($H$48:CC$48,$H8:CC8)<0.5, \"Pending\", IF(CC8<0.5, \"Complete\", \"In Progress\"))","v":"Pending"},0,0,{"$f":"IF(SUMPRODUCT($H$48:CF$48,$H8:CF8)<0.5, \"Pending\", IF(CF8<0.5, \"Complete\", \"In Progress\"))","v":"Pending"},0,0,{"$f":"IF(SUMPRODUCT($H$48:CI$48,$H8:CI8)<0.5, \"Pending\", IF(CI8<0.5, \"Complete\", \"In Progress\"))","v":"Pending"},0,0,{"$f":"IF(SUMPRODUCT($H$48:CL$48,$H8:CL8)<0.5, \"Pending\", IF(CL8<0.5, \"Complete\", \"In Progress\"))","v":"Pending"},0,0,{"$f":"IF(SUMPRODUCT($H$48:CO$48,$H8:CO8)<0.5, \"Pending\", IF(CO8<0.5, \"Complete\", \"In Progress\"))","v":"Pending"},0,0,{"$f":"IF(SUMPRODUCT($H$48:CR$48,$H8:CR8)<0.5, \"Pending\", IF(CR8<0.5, \"Complete\", \"In Progress\"))","v":"Pending"},0,0,{"$f":"IF(SUMPRODUCT($H$48:CU$48,$H8:CU8)<0.5, \"Pending\", IF(CU8<0.5, \"Complete\", \"In Progress\"))","v":"Pending"},0,0,{"$f":"IF(SUMPRODUCT($H$48:CX$48,$H8:CX8)<0.5, \"Pending\", IF(CX8<0.5, \"Complete\", \"In Progress\"))","v":"Pending"},0,0,{"$f":"IF(SUMPRODUCT($H$48:DA$48,$H8:DA8)<0.5, \"Pending\", IF(DA8<0.5, \"Complete\", \"In Progress\"))","v":"Pending"},0,0,{"$f":"IF(SUMPRODUCT($H$48:DD$48,$H8:DD8)<0.5, \"Pending\", IF(DD8<0.5, \"Complete\", \"In Progress\"))","v":"Pending"},0,0,{"$f":"IF(SUMPRODUCT($H$48:DG$48,$H8:DG8)<0.5, \"Pending\", IF(DG8<0.5, \"Complete\", \"In Progress\"))","v":"Pending"},0,0,{"$f":"IF(SUMPRODUCT($H$48:DJ$48,$H8:DJ8)<0.5, \"Pending\", IF(DJ8<0.5, \"Complete\", \"In Progress\"))","v":"Pending"},0,0,{"$f":"IF(SUMPRODUCT($H$48:DM$48,$H8:DM8)<0.5, \"Pending\", IF(DM8<0.5, \"Complete\", \"In Progress\"))","v":"Pending"},0,0,{"$f":"IF(SUMPRODUCT($H$48:DP$48,$H8:DP8)<0.5, \"Pending\", IF(DP8<0.5, \"Complete\", \"In Progress\"))","v":"Pending"},0,0,{"$f":"IF(SUMPRODUCT($H$48:DS$48,$H8:DS8)<0.5, \"Pending\", IF(DS8<0.5, \"Complete\", \"In Progress\"))","v":"Pending"},0,0,{"$f":"IF(SUMPRODUCT($H$48:DV$48,$H8:DV8)<0.5, \"Pending\", IF(DV8<0.5, \"Complete\", \"In Progress\"))","v":"Pending"},null,{"$f":"SUMPRODUCT($F$48:DE$48,$F8:DE8)","v":0}]
[null,null,null,"unassigned","Pending",1,0,0,0,{"$f":"IF(SUMPRODUCT($H$48:I$48,$H9:I9)<0.5, \"Pending\", IF(I9<0.5, \"Complete\", \"In Progress\"))","v":"Pending"},0,0,{"$f":"IF(SUMPRODUCT($H$48:L$48,$H9:L9)<0.5, \"Pending\", IF(L9<0.5, \"Complete\", \"In Progress\"))","v":"Pending"},0,0,{"$f":"IF(SUMPRODUCT($H$48:O$48,$H9:O9)<0.5, \"Pending\", IF(O9<0.5, \"Complete\", \"In Progress\"))","v":"Pending"},0,0,{"$f":"IF(SUMPRODUCT($H$48:R$48,$H9:R9)<0.5, \"Pending\", IF(R9<0.5, \"Complete\", \"In Progress\"))","v":"Pending"},0,0,{"$f":"IF(SUMPRODUCT($H$48:U$48,$H9:U9)<0.5, \"Pending\", IF(U9<0.5, \"Complete\", \"In Progress\"))","v":"Pending"},0,0,{"$f":"IF(SUMPRODUCT($H$48:X$48,$H9:X9)<0.5, \"Pending\", IF(X9<0.5, \"Complete\", \"In Progress\"))","v":"Pending"},0,0,{"$f":"IF(SUMPRODUCT($H$48:AA$48,$H9:AA9)<0.5, \"Pending\", IF(AA9<0.5, \"Complete\", \"In Progress\"))","v":"Pending"},0,0,{"$f":"IF(SUMPRODUCT($H$48:AD$48,$H9:AD9)<0.5, \"Pending\", IF(AD9<0.5, \"Complete\", \"In Progress\"))","v":"Pending"},0,0,{"$f":"IF(SUMPRODUCT($H$48:AG$48,$H9:AG9)<0.5, \"Pending\", IF(AG9<0.5, \"Complete\", \"In Progress\"))","v":"Pending"},0,0,{"$f":"IF(SUMPRODUCT($H$48:AJ$48,$H9:AJ9)<0.5, \"Pending\", IF(AJ9<0.5, \"Complete\", \"In Progress\"))","v":"Pending"},0,0,{"$f":"IF(SUMPRODUCT($H$48:AM$48,$H9:AM9)<0.5, \"Pending\", IF(AM9<0.5, \"Complete\", \"In Progress\"))","v":"Pending"},0,0,{"$f":"IF(SUMPRODUCT($H$48:AP$48,$H9:AP9)<0.5, \"Pending\", IF(AP9<0.5, \"Complete\", \"In Progress\"))","v":"Pending"},0,0,{"$f":"IF(SUMPRODUCT($H$48:AS$48,$H9:AS9)<0.5, \"Pending\", IF(AS9<0.5, \"Complete\", \"In Progress\"))","v":"Pending"},0,0,{"$f":"IF(SUMPRODUCT($H$48:AV$48,$H9:AV9)<0.5, \"Pending\", IF(AV9<0.5, \"Complete\", \"In Progress\"))","v":"Pending"},0,0,{"$f":"IF(SUMPRODUCT($H$48:AY$48,$H9:AY9)<0.5, \"Pending\", IF(AY9<0.5, \"Complete\", \"In Progress\"))","v":"Pending"},0,0,{"$f":"IF(SUMPRODUCT($H$48:BB$48,$H9:BB9)<0.5, \"Pending\", IF(BB9<0.5, \"Complete\", \"In Progress\"))","v":"Pending"},0,0,{"$f":"IF(SUMPRODUCT($H$48:BE$48,$H9:BE9)<0.5, \"Pending\", IF(BE9<0.5, \"Complete\", \"In Progress\"))","v":"Pending"},0,0,{"$f":"IF(SUMPRODUCT($H$48:BH$48,$H9:BH9)<0.5, \"Pending\", IF(BH9<0.5, \"Complete\", \"In Progress\"))","v":"Pending"},0,0,{"$f":"IF(SUMPRODUCT($H$48:BK$48,$H9:BK9)<0.5, \"Pending\", IF(BK9<0.5, \"Complete\", \"In Progress\"))","v":"Pending"},0,0,{"$f":"IF(SUMPRODUCT($H$48:BN$48,$H9:BN9)<0.5, \"Pending\", IF(BN9<0.5, \"Complete\", \"In Progress\"))","v":"Pending"},0,0,{"$f":"IF(SUMPRODUCT($H$48:BQ$48,$H9:BQ9)<0.5, \"Pending\", IF(BQ9<0.5, \"Complete\", \"In Progress\"))","v":"Pending"},0,0,{"$f":"IF(SUMPRODUCT($H$48:BT$48,$H9:BT9)<0.5, \"Pending\", IF(BT9<0.5, \"Complete\", \"In Progress\"))","v":"Pending"},0,0,{"$f":"IF(SUMPRODUCT($H$48:BW$48,$H9:BW9)<0.5, \"Pending\", IF(BW9<0.5, \"Complete\", \"In Progress\"))","v":"Pending"},0,0,{"$f":"IF(SUMPRODUCT($H$48:BZ$48,$H9:BZ9)<0.5, \"Pending\", IF(BZ9<0.5, \"Complete\", \"In Progress\"))","v":"Pending"},0,0,{"$f":"IF(SUMPRODUCT($H$48:CC$48,$H9:CC9)<0.5, \"Pending\", IF(CC9<0.5, \"Complete\", \"In Progress\"))","v":"Pending"},0,0,{"$f":"IF(SUMPRODUCT($H$48:CF$48,$H9:CF9)<0.5, \"Pending\", IF(CF9<0.5, \"Complete\", \"In Progress\"))","v":"Pending"},0,0,{"$f":"IF(SUMPRODUCT($H$48:CI$48,$H9:CI9)<0.5, \"Pending\", IF(CI9<0.5, \"Complete\", \"In Progress\"))","v":"Pending"},0,0,{"$f":"IF(SUMPRODUCT($H$48:CL$48,$H9:CL9)<0.5, \"Pending\", IF(CL9<0.5, \"Complete\", \"In Progress\"))","v":"Pending"},0,0,{"$f":"IF(SUMPRODUCT($H$48:CO$48,$H9:CO9)<0.5, \"Pending\", IF(CO9<0.5, \"Complete\", \"In Progress\"))","v":"Pending"},0,0,{"$f":"IF(SUMPRODUCT($H$48:CR$48,$H9:CR9)<0.5, \"Pending\", IF(CR9<0.5, \"Complete\", \"In Progress\"))","v":"Pending"},0,0,{"$f":"IF(SUMPRODUCT($H$48:CU$48,$H9:CU9)<0.5, \"Pending\", IF(CU9<0.5, \"Complete\", \"In Progress\"))","v":"Pending"},0,0,{"$f":"IF(SUMPRODUCT($H$48:CX$48,$H9:CX9)<0.5, \"Pending\", IF(CX9<0.5, \"Complete\", \"In Progress\"))","v":"Pending"},0,0,{"$f":"IF(SUMPRODUCT($H$48:DA$48,$H9:DA9)<0.5, \"Pending\", IF(DA9<0.5, \"Complete\", \"In Progress\"))","v":"Pending"},0,0,{"$f":"IF(SUMPRODUCT($H$48:DD$48,$H9:DD9)<0.5, \"Pending\", IF(DD9<0.5, \"Complete\", \"In Progress\"))","v":"Pending"},0,0,{"$f":"IF(SUMPRODUCT($H$48:DG$48,$H9:DG9)<0.5, \"Pending\", IF(DG9<0.5, \"Complete\", \"In Progress\"))","v":"Pending"},0,0,{"$f":"IF(SUMPRODUCT($H$48:DJ$48,$H9:DJ9)<0.5, \"Pending\", IF(DJ9<0.5, \"Complete\", \"In Progress\"))","v":"Pending"},0,0,{"$f":"IF(SUMPRODUCT($H$48:DM$48,$H9:DM9)<0.5, \"Pending\", IF(DM9<0.5, \"Complete\", \"In Progress\"))","v":"Pending"},0,0,{"$f":"IF(SUMPRODUCT($H$48:DP$48,$H9:DP9)<0.5, \"Pending\", IF(DP9<0.5, \"Complete\", \"In Progress\"))","v":"Pending"},0,0,{"$f":"IF(SUMPRODUCT($H$48:DS$48,$H9:DS9)<0.5, \"Pending\", IF(DS9<0.5, \"Complete\", \"In Progress\"))","v":"Pending"},0,0,{"$f":"IF(SUMPRODUCT($H$48:DV$48,$H9:DV9)<0.5, \"Pending\", IF(DV9<0.5, \"Complete\", \"In Progress\"))","v":"Pending"},null,{"$f":"SUMPRODUCT($F$48:DE$48,$F9:DE9)","v":0}]
[null,null,null,"unassigned","Pending",1,0,0,0,{"$f":"IF(SUMPRODUCT($H$48:I$48,$H10:I10)<0.5, \"Pending\", IF(I10<0.5, \"Complete\", \"In Progress\"))","v":"Pending"},0,0,{"$f":"IF(SUMPRODUCT($H$48:L$48,$H10:L10)<0.5, \"Pending\", IF(L10<0.5, \"Complete\", \"In Progress\"))","v":"Pending"},0,0,{"$f":"IF(SUMPRODUCT($H$48:O$48,$H10:O10)<0.5, \"Pending\", IF(O10<0.5, \"Complete\", \"In Progress\"))","v":"Pending"},0,0,{"$f":"IF(SUMPRODUCT($H$48:R$48,$H10:R10)<0.5, \"Pending\", IF(R10<0.5, \"Complete\", \"In Progress\"))","v":"Pending"},0,0,{"$f":"IF(SUMPRODUCT($H$48:U$48,$H10:U10)<0.5, \"Pending\", IF(U10<0.5, \"Complete\", \"In Progress\"))","v":"Pending"},0,0,{"$f":"IF(SUMPRODUCT($H$48:X$48,$H10:X10)<0.5, \"Pending\", IF(X10<0.5, \"Complete\", \"In Progress\"))","v":"Pending"},0,0,{"$f":"IF(SUMPRODUCT($H$48:AA$48,$H10:AA10)<0.5, \"Pending\", IF(AA10<0.5, \"Complete\", \"In Progress\"))","v":"Pending"},0,0,{"$f":"IF(SUMPRODUCT($H$48:AD$48,$H10:AD10)<0.5, \"Pending\", IF(AD10<0.5, \"Complete\", \"In Progress\"))","v":"Pending"},0,0,{"$f":"IF(SUMPRODUCT($H$48:AG$48,$H10:AG10)<0.5, \"Pending\", IF(AG10<0.5, \"Complete\", \"In Progress\"))","v":"Pending"},0,0,{"$f":"IF(SUMPRODUCT($H$48:AJ$48,$H10:AJ10)<0.5, \"Pending\", IF(AJ10<0.5, \"Complete\", \"In Progress\"))","v":"Pending"},0,0,{"$f":"IF(SUMPRODUCT($H$48:AM$48,$H10:AM10)<0.5, \"Pending\", IF(AM10<0.5, \"Complete\", \"In Progress\"))","v":"Pending"},0,0,{"$f":"IF(SUMPRODUCT($H$48:AP$48,$H10:AP10)<0.5, \"Pending\", IF(AP10<0.5, \"Complete\", \"In Progress\"))","v":"Pending"},0,0,{"$f":"IF(SUMPRODUCT($H$48:AS$48,$H10:AS10)<0.5, \"Pending\", IF(AS10<0.5, \"Complete\", \"In Progress\"))","v":"Pending"},0,0,{"$f":"IF(SUMPRODUCT($H$48:AV$48,$H10:AV10)<0.5, \"Pending\", IF(AV10<0.5, \"Complete\", \"In Progress\"))","v":"Pending"},0,0,{"$f":"IF(SUMPRODUCT($H$48:AY$48,$H10:AY10)<0.5, \"Pending\", IF(AY10<0.5, \"Complete\", \"In Progress\"))","v":"Pending"},0,0,{"$f":"IF(SUMPRODUCT($H$48:BB$48,$H10:BB10)<0.5, \"Pending\", IF(BB10<0.5, \"Complete\", \"In Progress\"))","v":"Pending"},0,0,{"$f":"IF(SUMPRODUCT($H$48:BE$48,$H10:BE10)<0.5, \"Pending\", IF(BE10<0.5, \"Complete\", \"In Progress\"))","v":"Pending"},0,0,{"$f":"IF(SUMPRODUCT($H$48:BH$48,$H10:BH10)<0.5, \"Pending\", IF(BH10<0.5, \"Complete\", \"In Progress\"))","v":"Pending"},0,0,{"$f":"IF(SUMPRODUCT($H$48:BK$48,$H10:BK10)<0.5, \"Pending\", IF(BK10<0.5, \"Complete\", \"In Progress\"))","v":"Pending"},0,0,{"$f":"IF(SUMPRODUCT($H$48:BN$48,$H10:BN10)<0.5, \"Pending\", IF(BN10<0.5, \"Complete\", \"In Progress\"))","v":"Pending"},0,0,{"$f":"IF(SUMPRODUCT($H$48:BQ$48,$H10:BQ10)<0.5, \"Pending\", IF(BQ10<0.5, \"Complete\", \"In Progress\"))","v":"Pending"},0,0,{"$f":"IF(SUMPRODUCT($H$48:BT$48,$H10:BT10)<0.5, \"Pending\", IF(BT10<0.5, \"Complete\", \"In Progress\"))","v":"Pending"},0,0,{"$f":"IF(SUMPRODUCT($H$48:BW$48,$H10:BW10)<0.5, \"Pending\", IF(BW10<0.5, \"Complete\", \"In Progress\"))","v":"Pending"},0,0,{"$f":"IF(SUMPRODUCT($H$48:BZ$48,$H10:BZ10)<0.5, \"Pending\", IF(BZ10<0.5, \"Complete\", \"In Progress\"))","v":"Pending"},0,0,{"$f":"IF(SUMPRODUCT($H$48:CC$48,$H10:CC10)<0.5, \"Pending\", IF(CC10<0.5, \"Complete\", \"In Progress\"))","v":"Pending"},0,0,{"$f":"IF(SUMPRODUCT($H$48:CF$48,$H10:CF10)<0.5, \"Pending\", IF(CF10<0.5, \"Complete\", \"In Progress\"))","v":"Pending"},0,0,{"$f":"IF(SUMPRODUCT($H$48:CI$48,$H10:CI10)<0.5, \"Pending\", IF(CI10<0.5, \"Complete\", \"In Progress\"))","v":"Pending"},0,0,{"$f":"IF(SUMPRODUCT($H$48:CL$48,$H10:CL10)<0.5, \"Pending\", IF(CL10<0.5, \"Complete\", \"In Progress\"))","v":"Pending"},0,0,{"$f":"IF(SUMPRODUCT($H$48:CO$48,$H10:CO10)<0.5, \"Pending\", IF(CO10<0.5, \"Complete\", \"In Progress\"))","v":"Pending"},0,0,{"$f":"IF(SUMPRODUCT($H$48:CR$48,$H10:CR10)<0.5, \"Pending\", IF(CR10<0.5, \"Complete\", \"In Progress\"))","v":"Pending"},0,0,{"$f":"IF(SUMPRODUCT($H$48:CU$48,$H10:CU10)<0.5, \"Pending\", IF(CU10<0.5, \"Complete\", \"In Progress\"))","v":"Pending"},0,0,{"$f":"IF(SUMPRODUCT($H$48:CX$48,$H10:CX10)<0.5, \"Pending\", IF(CX10<0.5, \"Complete\", \"In Progress\"))","v":"Pending"},0,0,{"$f":"IF(SUMPRODUCT($H$48:DA$48,$H10:DA10)<0.5, \"Pending\", IF(DA10<0.5, \"Complete\", \"In Progress\"))","v":"Pending"},0,0,{"$f":"IF(SUMPRODUCT($H$48:DD$48,$H10:DD10)<0.5, \"Pending\", IF(DD10<0.5, \"Complete\", \"In Progress\"))","v":"Pending"},0,0,{"$f":"IF(SUMPRODUCT($H$48:DG$48,$H10:DG10)<0.5, \"Pending\", IF(DG10<0.5, \"Complete\", \"In Progress\"))","v":"Pending"},0,0,{"$f":"IF(SUMPRODUCT($H$48:DJ$48,$H10:DJ10)<0.5, \"Pending\", IF(DJ10<0.5, \"Complete\", \"In Progress\"))","v":"Pending"},0,0,{"$f":"IF(SUMPRODUCT($H$48:DM$48,$H10:DM10)<0.5, \"Pending\", IF(DM10<0.5, \"Complete\", \"In Progress\"))","v":"Pending"},0,0,{"$f":"IF(SUMPRODUCT($H$48:DP$48,$H10:DP10)<0.5, \"Pending\", IF(DP10<0.5, \"Complete\", \"In Progress\"))","v":"Pending"},0,0,{"$f":"IF(SUMPRODUCT($H$48:DS$48,$H10:DS10)<0.5, \"Pending\", IF(DS10<0.5, \"Complete\", \"In Progress\"))","v":"Pending"},0,0,{"$f":"IF(SUMPRODUCT($H$48:DV$48,$H10:DV10)<0.5, \"Pending\", IF(DV10<0.5, \"Complete\", \"In Progress\"))","v":"Pending"},null,{"$f":"SUMPRODUCT($F$48:DE$48,$F10:DE10)","v":0}]
[null,null,null,"unassigned","Pending",1,0,0,0,{"$f":"IF(SUMPRODUCT($H$48:I$48,$H11:I11)<0.5, \"Pending\", IF(I11<0.5, \"Complete\", \"In Progress\"))","v":"Pending"},0,0,{"$f":"IF(SUMPRODUCT($H$48:L$48,$H11:L11)<0.5, \"Pending\", IF(L11<0.5, \"Complete\", \"In Progress\"))","v":"Pending"},0,0,{"$f":"IF(SUMPRODUCT($H$48:O$48,$H11:O11)<0.5, \"Pending\", IF(O11<0.5, \"Complete\", \"In Progress\"))","v":"Pending"},0,0,{"$f":"IF(SUMPRODUCT($H$48:R$48,$H11:R11)<0.5, \"Pending\", IF(R11<0.5, \"Complete\", \"In Progress\"))","v":"Pending"},0,0,{"$f":"IF(SUMPRODUCT($H$48:U$48,$H11:U11)<0.5, \"Pending\", IF(U11<0.5, \"Complete\", \"In Progress\"))","v":"Pending"},0,0,{"$f":"IF(SUMPRODUCT($H$48:X$48,$H11:X11)<0.5, \"Pending\", IF(X11<0.5, \"Complete\", \"In Progress\"))","v":"Pending"},0,0,{"$f":"IF(SUMPRODUCT($H$48:AA$48,$H11:AA11)<0.5, \"Pending\", IF(AA11<0.5, \"Complete\", \"In Progress\"))","v":"Pending"},0,0,{"$f":"IF(SUMPRODUCT($H$48:AD$48,$H11:AD11)<0.5, \"Pending\", IF(AD11<0.5, \"Complete\", \"In Progress\"))","v":"Pending"},0,0,{"$f":"IF(SUMPRODUCT($H$48:AG$48,$H11:AG11)<0.5, \"Pending\", IF(AG11<0.5, \"Complete\", \"In Progress\"))","v":"Pending"},0,0,{"$f":"IF(SUMPRODUCT($H$48:AJ$48,$H11:AJ11)<0.5, \"Pending\", IF(AJ11<0.5, \"Complete\", \"In Progress\"))","v":"Pending"},0,0,{"$f":"IF(SUMPRODUCT($H$48:AM$48,$H11:AM11)<0.5, \"Pending\", IF(AM11<0.5, \"Complete\", \"In Progress\"))","v":"Pending"},0,0,{"$f":"IF(SUMPRODUCT($H$48:AP$48,$H11:AP11)<0.5, \"Pending\", IF(AP11<0.5, \"Complete\", \"In Progress\"))","v":"Pending"},0,0,{"$f":"IF(SUMPRODUCT($H$48:AS$48,$H11:AS11)<0.5, \"Pending\", IF(AS11<0.5, \"Complete\", \"In Progress\"))","v":"Pending"},0,0,{"$f":"IF(SUMPRODUCT($H$48:AV$48,$H11:AV11)<0.5, \"Pending\", IF(AV11<0.5, \"Complete\", \"In Progress\"))","v":"Pending"},0,0,{"$f":"IF(SUMPRODUCT($H$48:AY$48,$H11:AY11)<0.5, \"Pending\", IF(AY11<0.5, \"Complete\", \"In Progress\"))","v":"Pending"},0,0,{"$f":"IF(SUMPRODUCT($H$48:BB$48,$H11:BB11)<0.5, \"Pending\", IF(BB11<0.5, \"Complete\", \"In Progress\"))","v":"Pending"},0,0,{"$f":"IF(SUMPRODUCT($H$48:BE$48,$H11:BE11)<0.5, \"Pending\", IF(BE11<0.5, \"Complete\", \"In Progress\"))","v":"Pending"},0,0,{"$f":"IF(SUMPRODUCT($H$48:BH$48,$H11:BH11)<0.5, \"Pending\", IF(BH11<0.5, \"Complete\", \"In Progress\"))","v":"Pending"},0,0,{"$f":"IF(SUMPRODUCT($H$48:BK$48,$H11:BK11)<0.5, \"Pending\", IF(BK11<0.5, \"Complete\", \"In Progress\"))","v":"Pending"},0,0,{"$f":"IF(SUMPRODUCT($H$48:BN$48,$H11:BN11)<0.5, \"Pending\", IF(BN11<0.5, \"Complete\", \"In Progress\"))","v":"Pending"},0,0,{"$f":"IF(SUMPRODUCT($H$48:BQ$48,$H11:BQ11)<0.5, \"Pending\", IF(BQ11<0.5, \"Complete\", \"In Progress\"))","v":"Pending"},0,0,{"$f":"IF(SUMPRODUCT($H$48:BT$48,$H11:BT11)<0.5, \"Pending\", IF(BT11<0.5, \"Complete\", \"In Progress\"))","v":"Pending"},0,0,{"$f":"IF(SUMPRODUCT($H$48:BW$48,$H11:BW11)<0.5, \"Pending\", IF(BW11<0.5, \"Complete\", \"In Progress\"))","v":"Pending"},0,0,{"$f":"IF(SUMPRODUCT($H$48:BZ$48,$H11:BZ11)<0.5, \"Pending\", IF(BZ11<0.5, \"Complete\", \"In Progress\"))","v":"Pending"},0,0,{"$f":"IF(SUMPRODUCT($H$48:CC$48,$H11:CC11)<0.5, \"Pending\", IF(CC11<0.5, \"Complete\", \"In Progress\"))","v":"Pending"},0,0,{"$f":"IF(SUMPRODUCT($H$48:CF$48,$H11:CF11)<0.5, \"Pending\", IF(CF11<0.5, \"Complete\", \"In Progress\"))","v":"Pending"},0,0,{"$f":"IF(SUMPRODUCT($H$48:CI$48,$H11:CI11)<0.5, \"Pending\", IF(CI11<0.5, \"Complete\", \"In Progress\"))","v":"Pending"},0,0,{"$f":"IF(SUMPRODUCT($H$48:CL$48,$H11:CL11)<0.5, \"Pending\", IF(CL11<0.5, \"Complete\", \"In Progress\"))","v":"Pending"},0,0,{"$f":"IF(SUMPRODUCT($H$48:CO$48,$H11:CO11)<0.5, \"Pending\", IF(CO11<0.5, \"Complete\", \"In Progress\"))","v":"Pending"},0,0,{"$f":"IF(SUMPRODUCT($H$48:CR$48,$H11:CR11)<0.5, \"Pending\", IF(CR11<0.5, \"Complete\", \"In Progress\"))","v":"Pending"},0,0,{"$f":"IF(SUMPRODUCT($H$48:CU$48,$H11:CU11)<0.5, \"Pending\", IF(CU11<0.5, \"Complete\", \"In Progress\"))","v":"Pending"},0,0,{"$f":"IF(SUMPRODUCT($H$48:CX$48,$H11:CX11)<0.5, \"Pending\", IF(CX11<0.5, \"Complete\", \"In Progress\"))","v":"Pending"},0,0,{"$f":"IF(SUMPRODUCT($H$48:DA$48,$H11:DA11)<0.5, \"Pending\", IF(DA11<0.5, \"Complete\", \"In Progress\"))","v":"Pending"},0,0,{"$f":"IF(SUMPRODUCT($H$48:DD$48,$H11:DD11)<0.5, \"Pending\", IF(DD11<0.5, \"Complete\", \"In Progress\"))","v":"Pending"},0,0,{"$f":"IF(SUMPRODUCT($H$48:DG$48,$H11:DG11)<0.5, \"Pending\", IF(DG11<0.5, \"Complete\", \"In Progress\"))","v":"Pending"},0,0,{"$f":"IF(SUMPRODUCT($H$48:DJ$48,$H11:DJ11)<0.5, \"Pending\", IF(DJ11<0.5, \"Complete\", \"In Progress\"))","v":"Pending"},0,0,{"$f":"IF(SUMPRODUCT($H$48:DM$48,$H11:DM11)<0.5, \"Pending\", IF(DM11<0.5, \"Complete\", \"In Progress\"))","v":"Pending"},0,0,{"$f":"IF(SUMPRODUCT($H$48:DP$48,$H11:DP11)<0.5, \"Pending\", IF(DP11<0.5, \"Complete\", \"In Progress\"))","v":"Pending"},0,0,{"$f":"IF(SUMPRODUCT($H$48:DS$48,$H11:DS11)<0.5, \"Pending\", IF(DS11<0.5, \"Complete\", \"In Progress\"))","v":"Pending"},0,0,{"$f":"IF(SUMPRODUCT($H$48:DV$48,$H11:DV11)<0.5, \"Pending\", IF(DV11<0.5, \"Complete\", \"In Progress\"))","v":"Pending"},null,{"$f":"SUMPRODUCT($F$48:DE$48,$F11:DE11)","v":0}]
[null,null,null,"unassigned","Pending",1,0,0,0,{"$f":"IF(SUMPRODUCT($H$48:I$48,$H12:I12)<0.5, \"Pending\", IF(I12<0.5, \"Complete\", \"In Progress\"))","v":"Pending"},0,0,{"$f":"IF(SUMPRODUCT($H$48:L$48,$H12:L12)<0.5, \"Pending\", IF(L12<0.5, \"Complete\", \"In Progress\"))","v":"Pending"},0,0,{"$f":"IF(SUMPRODUCT($H$48:O$48,$H12:O12)<0.5, \"Pending\", IF(O12<0.5, \"Complete\", \"In Progress\"))","v":"Pending"},0,0,{"$f":"IF(SUMPRODUCT($H$48:R$48,$H12:R12)<0.5, \"Pending\", IF(R12<0.5, \"Complete\", \"In Progress\"))","v":"Pending"},0,0,{"$f":"IF(SUMPRODUCT($H$48:U$48,$H12:U12)<0.5, \"Pending\", IF(U12<0.5, \"Complete\", \"In Progress\"))","v":"Pending"},0,0,{"$f":"IF(SUMPRODUCT($H$48:X$48,$H12:X12)<0.5, \"Pending\", IF(X12<0.5, \"Complete\", \"In Progress\"))","v":"Pending"},0,0,{"$f":"IF(SUMPRODUCT($H$48:AA$48,$H12:AA12)<0.5, \"Pending\", IF(AA12<0.5, \"Complete\", \"In Progress\"))","v":"Pending"},0,0,{"$f":"IF(SUMPRODUCT($H$48:AD$48,$H12:AD12)<0.5, \"Pending\", IF(AD12<0.5, \"Complete\", \"In Progress\"))","v":"Pending"},0,0,{"$f":"IF(SUMPRODUCT($H$48:AG$48,$H12:AG12)<0.5, \"Pending\", IF(AG12<0.5, \"Complete\", \"In Progress\"))","v":"Pending"},0,0,{"$f":"IF(SUMPRODUCT($H$48:AJ$48,$H12:AJ12)<0.5, \"Pending\", IF(AJ12<0.5, \"Complete\", \"In Progress\"))","v":"Pending"},0,0,{"$f":"IF(SUMPRODUCT($H$48:AM$48,$H12:AM12)<0.5, \"Pending\", IF(AM12<0.5, \"Complete\", \"In Progress\"))","v":"Pending"},0,0,{"$f":"IF(SUMPRODUCT($H$48:AP$48,$H12:AP12)<0.5, \"Pending\", IF(AP12<0.5, \"Complete\", \"In Progress\"))","v":"Pending"},0,0,{"$f":"IF(SUMPRODUCT($H$48:AS$48,$H12:AS12)<0.5, \"Pending\", IF(AS12<0.5, \"Complete\", \"In Progress\"))","v":"Pending"},0,0,{"$f":"IF(SUMPRODUCT($H$48:AV$48,$H12:AV12)<0.5, \"Pending\", IF(AV12<0.5, \"Complete\", \"In Progress\"))","v":"Pending"},0,0,{"$f":"IF(SUMPRODUCT($H$48:AY$48,$H12:AY12)<0.5, \"Pending\", IF(AY12<0.5, \"Complete\", \"In Progress\"))","v":"Pending"},0,0,{"$f":"IF(SUMPRODUCT($H$48:BB$48,$H12:BB12)<0.5, \"Pending\", IF(BB12<0.5, \"Complete\", \"In Progress\"))","v":"Pending"},0,0,{"$f":"IF(SUMPRODUCT($H$48:BE$48,$H12:BE12)<0.5, \"Pending\", IF(BE12<0.5, \"Complete\", \"In Progress\"))","v":"Pending"},0,0,{"$f":"IF(SUMPRODUCT($H$48:BH$48,$H12:BH12)<0.5, \"Pending\", IF(BH12<0.5, \"Complete\", \"In Progress\"))","v":"Pending"},0,0,{"$f":"IF(SUMPRODUCT($H$48:BK$48,$H12:BK12)<0.5, \"Pending\", IF(BK12<0.5, \"Complete\", \"In Progress\"))","v":"Pending"},0,0,{"$f":"IF(SUMPRODUCT($H$48:BN$48,$H12:BN12)<0.5, \"Pending\", IF(BN12<0.5, \"Complete\", \"In Progress\"))","v":"Pending"},0,0,{"$f":"IF(SUMPRODUCT($H$48:BQ$48,$H12:BQ12)<0.5, \"Pending\", IF(BQ12<0.5, \"Complete\", \"In Progress\"))","v":"Pending"},0,0,{"$f":"IF(SUMPRODUCT($H$48:BT$48,$H12:BT12)<0.5, \"Pending\", IF(BT12<0.5, \"Complete\", \"In Progress\"))","v":"Pending"},0,0,{"$f":"IF(SUMPRODUCT($H$48:BW$48,$H12:BW12)<0.5, \"Pending\", IF(BW12<0.5, \"Complete\", \"In Progress\"))","v":"Pending"},0,0,{"$f":"IF(SUMPRODUCT($H$48:BZ$48,$H12:BZ12)<0.5, \"Pending\", IF(BZ12<0.5, \"Complete\", \"In Progress\"))","v":"Pending"},0,0,{"$f":"IF(SUMPRODUCT($H$48:CC$48,$H12:CC12)<0.5, \"Pending\", IF(CC12<0.5, \"Complete\", \"In Progress\"))","v":"Pending"},0,0,{"$f":"IF(SUMPRODUCT($H$48:CF$48,$H12:CF12)<0.5, \"Pending\", IF(CF12<0.5, \"Complete\", \"In Progress\"))","v":"Pending"},0,0,{"$f":"IF(SUMPRODUCT($H$48:CI$48,$H12:CI12)<0.5, \"Pending\", IF(CI12<0.5, \"Complete\", \"In Progress\"))","v":"Pending"},0,0,{"$f":"IF(SUMPRODUCT($H$48:CL$48,$H12:CL12)<0.5, \"Pending\", IF(CL12<0.5, \"Complete\", \"In Progress\"))","v":"Pending"},0,0,{"$f":"IF(SUMPRODUCT($H$48:CO$48,$H12:CO12)<0.5, \"Pending\", IF(CO12<0.5, \"Complete\", \"In Progress\"))","v":"Pending"},0,0,{"$f":"IF(SUMPRODUCT($H$48:CR$48,$H12:CR12)<0.5, \"Pending\", IF(CR12<0.5, \"Complete\", \"In Progress\"))","v":"Pending"},0,0,{"$f":"IF(SUMPRODUCT($H$48:CU$48,$H12:CU12)<0.5, \"Pending\", IF(CU12<0.5, \"Complete\", \"In Progress\"))","v":"Pending"},0,0,{"$f":"IF(SUMPRODUCT($H$48:CX$48,$H12:CX12)<0.5, \"Pending\", IF(CX12<0.5, \"Complete\", \"In Progress\"))","v":"Pending"},0,0,{"$f":"IF(SUMPRODUCT($H$48:DA$48,$H12:DA12)<0.5, \"Pending\", IF(DA12<0.5, \"Complete\", \"In Progress\"))","v":"Pending"},0,0,{"$f":"IF(SUMPRODUCT($H$48:DD$48,$H12:DD12)<0.5, \"Pending\", IF(DD12<0.5, \"Complete\", \"In Progress\"))","v":"Pending"},0,0,{"$f":"IF(SUMPRODUCT($H$48:DG$48,$H12:DG12)<0.5, \"Pending\", IF(DG12<0.5, \"Complete\", \"In Progress\"))","v":"Pending"},0,0,{"$f":"IF(SUMPRODUCT($H$48:DJ$48,$H12:DJ12)<0.5, \"Pending\", IF(DJ12<0.5, \"Complete\", \"In Progress\"))","v":"Pending"},0,0,{"$f":"IF(SUMPRODUCT($H$48:DM$48,$H12:DM12)<0.5, \"Pending\", IF(DM12<0.5, \"Complete\", \"In Progress\"))","v":"Pending"},0,0,{"$f":"IF(SUMPRODUCT($H$48:DP$48,$H12:DP12)<0.5, \"Pending\", IF(DP12<0.5, \"Complete\", \"In Progress\"))","v":"Pending"},0,0,{"$f":"IF(SUMPRODUCT($H$48:DS$48,$H12:DS12)<0.5, \"Pending\", IF(DS12<0.5, \"Complete\", \"In Progress\"))","v":"Pending"},0,0,{"$f":"IF(SUMPRODUCT($H$48:DV$48,$H12:DV12)<0.5, \"Pending\", IF(DV12<0.5, \"Complete\", \"In Progress\"))","v":"Pending"},null,{"$f":"SUMPRODUCT($F$48:DE$48,$F12:DE12)","v":0}]
[null,null,null,"unassigned","Pending",1,0,0,0,{"$f":"IF(SUMPRODUCT($H$48:I$48,$H13:I13)<0.5, \"Pending\", IF(I13<0.5, \"Complete\", \"In Progress\"))","v":"Pending"},0,0,{"$f":"IF(SUMPRODUCT($H$48:L$48,$H13:L13)<0.5, \"Pending\", IF(L13<0.5, \"Complete\", \"In Progress\"))","v":"Pending"},0,0,{"$f":"IF(SUMPRODUCT($H$48:O$48,$H13:O13)<0.5, \"Pending\", IF(O13<0.5, \"Complete\", \"In Progress\"))","v":"Pending"},0,0,{"$f":"IF(SUMPRODUCT($H$48:R$48,$H13:R13)<0.5, \"Pending\", IF(R13<0.5, \"Complete\", \"In Progress\"))","v":"Pending"},0,0,{"$f":"IF(SUMPRODUCT($H$48:U$48,$H13:U13)<0.5, \"Pending\", IF(U13<0.5, \"Complete\", \"In Progress\"))","v":"Pending"},0,0,{"$f":"IF(SUMPRODUCT($H$48:X$48,$H13:X13)<0.5, \"Pending\", IF(X13<0.5, \"Complete\", \"In Progress\"))","v":"Pending"},0,0,{"$f":"IF(SUMPRODUCT($H$48:AA$48,$H13:AA13)<0.5, \"Pending\", IF(AA13<0.5, \"Complete\", \"In Progress\"))","v":"Pending"},0,0,{"$f":"IF(SUMPRODUCT($H$48:AD$48,$H13:AD13)<0.5, \"Pending\", IF(AD13<0.5, \"Complete\", \"In Progress\"))","v":"Pending"},0,0,{"$f":"IF(SUMPRODUCT($H$48:AG$48,$H13:AG13)<0.5, \"Pending\", IF(AG13<0.5, \"Complete\", \"In Progress\"))","v":"Pending"},0,0,{"$f":"IF(SUMPRODUCT($H$48:AJ$48,$H13:AJ13)<0.5, \"Pending\", IF(AJ13<0.5, \"Complete\", \"In Progress\"))","v":"Pending"},0,0,{"$f":"IF(SUMPRODUCT($H$48:AM$48,$H13:AM13)<0.5, \"Pending\", IF(AM13<0.5, \"Complete\", \"In Progress\"))","v":"Pending"},0,0,{"$f":"IF(SUMPRODUCT($H$48:AP$48,$H13:AP13)<0.5, \"Pending\", IF(AP13<0.5, \"Complete\", \"In Progress\"))","v":"Pending"},0,0,{"$f":"IF(SUMPRODUCT($H$48:AS$48,$H13:AS13)<0.5, \"Pending\", IF(AS13<0.5, \"Complete\", \"In Progress\"))","v":"Pending"},0,0,{"$f":"IF(SUMPRODUCT($H$48:AV$48,$H13:AV13)<0.5, \"Pending\", IF(AV13<0.5, \"Complete\", \"In Progress\"))","v":"Pending"},0,0,{"$f":"IF(SUMPRODUCT($H$48:AY$48,$H13:AY13)<0.5, \"Pending\", IF(AY13<0.5, \"Complete\", \"In Progress\"))","v":"Pending"},0,0,{"$f":"IF(SUMPRODUCT($H$48:BB$48,$H13:BB13)<0.5, \"Pending\", IF(BB13<0.5, \"Complete\", \"In Progress\"))","v":"Pending"},0,0,{"$f":"IF(SUMPRODUCT($H$48:BE$48,$H13:BE13)<0.5, \"Pending\", IF(BE13<0.5, \"Complete\", \"In Progress\"))","v":"Pending"},0,0,{"$f":"IF(SUMPRODUCT($H$48:BH$48,$H13:BH13)<0.5, \"Pending\", IF(BH13<0.5, \"Complete\", \"In Progress\"))","v":"Pending"},0,0,{"$f":"IF(SUMPRODUCT($H$48:BK$48,$H13:BK13)<0.5, \"Pending\", IF(BK13<0.5, \"Complete\", \"In Progress\"))","v":"Pending"},0,0,{"$f":"IF(SUMPRODUCT($H$48:BN$48,$H13:BN13)<0.5, \"Pending\", IF(BN13<0.5, \"Complete\", \"In Progress\"))","v":"Pending"},0,0,{"$f":"IF(SUMPRODUCT($H$48:BQ$48,$H13:BQ13)<0.5, \"Pending\", IF(BQ13<0.5, \"Complete\", \"In Progress\"))","v":"Pending"},0,0,{"$f":"IF(SUMPRODUCT($H$48:BT$48,$H13:BT13)<0.5, \"Pending\", IF(BT13<0.5, \"Complete\", \"In Progress\"))","v":"Pending"},0,0,{"$f":"IF(SUMPRODUCT($H$48:BW$48,$H13:BW13)<0.5, \"Pending\", IF(BW13<0.5, \"Complete\", \"In Progress\"))","v":"Pending"},0,0,{"$f":"IF(SUMPRODUCT($H$48:BZ$48,$H13:BZ13)<0.5, \"Pending\", IF(BZ13<0.5, \"Complete\", \"In Progress\"))","v":"Pending"},0,0,{"$f":"IF(SUMPRODUCT($H$48:CC$48,$H13:CC13)<0.5, \"Pending\", IF(CC13<0.5, \"Complete\", \"In Progress\"))","v":"Pending"},0,0,{"$f":"IF(SUMPRODUCT($H$48:CF$48,$H13:CF13)<0.5, \"Pending\", IF(CF13<0.5, \"Complete\", \"In Progress\"))","v":"Pending"},0,0,{"$f":"IF(SUMPRODUCT($H$48:CI$48,$H13:CI13)<0.5, \"Pending\", IF(CI13<0.5, \"Complete\", \"In Progress\"))","v":"Pending"},0,0,{"$f":"IF(SUMPRODUCT($H$48:CL$48,$H13:CL13)<0.5, \"Pending\", IF(CL13<0.5, \"Complete\", \"In Progress\"))","v":"Pending"},0,0,{"$f":"IF(SUMPRODUCT($H$48:CO$48,$H13:CO13)<0.5, \"Pending\", IF(CO13<0.5, \"Complete\", \"In Progress\"))","v":"Pending"},0,0,{"$f":"IF(SUMPRODUCT($H$48:CR$48,$H13:CR13)<0.5, \"Pending\", IF(CR13<0.5, \"Complete\", \"In Progress\"))","v":"Pending"},0,0,{"$f":"IF(SUMPRODUCT($H$48:CU$48,$H13:CU13)<0.5, \"Pending\", IF(CU13<0.5, \"Complete\", \"In Progress\"))","v":"Pending"},0,0,{"$f":"IF(SUMPRODUCT($H$48:CX$48,$H13:CX13)<0.5, \"Pending\", IF(CX13<0.5, \"Complete\", \"In Progress\"))","v":"Pending"},0,0,{"$f":"IF(SUMPRODUCT($H$48:DA$48,$H13:DA13)<0.5, \"Pending\", IF(DA13<0.5, \"Complete\", \"In Progress\"))","v":"Pending"},0,0,{"$f":"IF(SUMPRODUCT($H$48:DD$48,$H13:DD13)<0.5, \"Pending\", IF(DD13<0.5, \"Complete\", \"In Progress\"))","v":"Pending"},0,0,{"$f":"IF(SUMPRODUCT($H$48:DG$48,$H13:DG13)<0.5, \"Pending\", IF(DG13<0.5, \"Complete\", \"In Progress\"))","v":"Pending"},0,0,{"$f":"IF(SUMPRODUCT($H$48:DJ$48,$H13:DJ13)<0.5, \"Pending\", IF(DJ13<0.5, \"Complete\", \"In Progress\"))","v":"Pending"},0,0,{"$f":"IF(SUMPRODUCT($H$48:DM$48,$H13:DM13)<0.5, \"Pending\", IF(DM13<0.5, \"Complete\", \"In Progress\"))","v":"Pending"},0,0,{"$f":"IF(SUMPRODUCT($H$48:DP$48,$H13:DP13)<0.5, \"Pending\", IF(DP13<0.5, \"Complete\", \"In Progress\"))","v":"Pending"},0,0,{"$f":"IF(SUMPRODUCT($H$48:DS$48,$H13:DS13)<0.5, \"Pending\", IF(DS13<0.5, \"Complete\", \"In Progress\"))","v":"Pending"},0,0,{"$f":"IF(SUMPRODUCT($H$48:DV$48,$H13:DV13)<0.5, \"Pending\", IF(DV13<0.5, \"Complete\", \"In Progress\"))","v":"Pending"},null,{"$f":"SUMPRODUCT($F$48:DE$48,$F13:DE13)","v":0}]
[null,null,null,"unassigned","Pending",1,0,0,0,{"$f":"IF(SUMPRODUCT($H$48:I$48,$H14:I14)<0.5, \"Pending\", IF(I14<0.5, \"Complete\", \"In Progress\"))","v":"Pending"},0,0,{"$f":"IF(SUMPRODUCT($H$48:L$48,$H14:L14)<0.5, \"Pending\", IF(L14<0.5, \"Complete\", \"In Progress\"))","v":"Pending"},0,0,{"$f":"IF(SUMPRODUCT($H$48:O$48,$H14:O14)<0.5, \"Pending\", IF(O14<0.5, \"Complete\", \"In Progress\"))","v":"Pending"},0,0,{"$f":"IF(SUMPRODUCT($H$48:R$48,$H14:R14)<0.5, \"Pending\", IF(R14<0.5, \"Complete\", \"In Progress\"))","v":"Pending"},0,0,{"$f":"IF(SUMPRODUCT($H$48:U$48,$H14:U14)<0.5, \"Pending\", IF(U14<0.5, \"Complete\", \"In Progress\"))","v":"Pending"},0,0,{"$f":"IF(SUMPRODUCT($H$48:X$48,$H14:X14)<0.5, \"Pending\", IF(X14<0.5, \"Complete\", \"In Progress\"))","v":"Pending"},0,0,{"$f":"IF(SUMPRODUCT($H$48:AA$48,$H14:AA14)<0.5, \"Pending\", IF(AA14<0.5, \"Complete\", \"In Progress\"))","v":"Pending"},0,0,{"$f":"IF(SUMPRODUCT($H$48:AD$48,$H14:AD14)<0.5, \"Pending\", IF(AD14<0.5, \"Complete\", \"In Progress\"))","v":"Pending"},0,0,{"$f":"IF(SUMPRODUCT($H$48:AG$48,$H14:AG14)<0.5, \"Pending\", IF(AG14<0.5, \"Complete\", \"In Progress\"))","v":"Pending"},0,0,{"$f":"IF(SUMPRODUCT($H$48:AJ$48,$H14:AJ14)<0.5, \"Pending\", IF(AJ14<0.5, \"Complete\", \"In Progress\"))","v":"Pending"},0,0,{"$f":"IF(SUMPRODUCT($H$48:AM$48,$H14:AM14)<0.5, \"Pending\", IF(AM14<0.5, \"Complete\", \"In Progress\"))","v":"Pending"},0,0,{"$f":"IF(SUMPRODUCT($H$48:AP$48,$H14:AP14)<0.5, \"Pending\", IF(AP14<0.5, \"Complete\", \"In Progress\"))","v":"Pending"},0,0,{"$f":"IF(SUMPRODUCT($H$48:AS$48,$H14:AS14)<0.5, \"Pending\", IF(AS14<0.5, \"Complete\", \"In Progress\"))","v":"Pending"},0,0,{"$f":"IF(SUMPRODUCT($H$48:AV$48,$H14:AV14)<0.5, \"Pending\", IF(AV14<0.5, \"Complete\", \"In Progress\"))","v":"Pending"},0,0,{"$f":"IF(SUMPRODUCT($H$48:AY$48,$H14:AY14)<0.5, \"Pending\", IF(AY14<0.5, \"Complete\", \"In Progress\"))","v":"Pending"},0,0,{"$f":"IF(SUMPRODUCT($H$48:BB$48,$H14:BB14)<0.5, \"Pending\", IF(BB14<0.5, \"Complete\", \"In Progress\"))","v":"Pending"},0,0,{"$f":"IF(SUMPRODUCT($H$48:BE$48,$H14:BE14)<0.5, \"Pending\", IF(BE14<0.5, \"Complete\", \"In Progress\"))","v":"Pending"},0,0,{"$f":"IF(SUMPRODUCT($H$48:BH$48,$H14:BH14)<0.5, \"Pending\", IF(BH14<0.5, \"Complete\", \"In Progress\"))","v":"Pending"},0,0,{"$f":"IF(SUMPRODUCT($H$48:BK$48,$H14:BK14)<0.5, \"Pending\", IF(BK14<0.5, \"Complete\", \"In Progress\"))","v":"Pending"},0,0,{"$f":"IF(SUMPRODUCT($H$48:BN$48,$H14:BN14)<0.5, \"Pending\", IF(BN14<0.5, \"Complete\", \"In Progress\"))","v":"Pending"},0,0,{"$f":"IF(SUMPRODUCT($H$48:BQ$48,$H14:BQ14)<0.5, \"Pending\", IF(BQ14<0.5, \"Complete\", \"In Progress\"))","v":"Pending"},0,0,{"$f":"IF(SUMPRODUCT($H$48:BT$48,$H14:BT14)<0.5, \"Pending\", IF(BT14<0.5, \"Complete\", \"In Progress\"))","v":"Pending"},0,0,{"$f":"IF(SUMPRODUCT($H$48:BW$48,$H14:BW14)<0.5, \"Pending\", IF(BW14<0.5, \"Complete\", \"In Progress\"))","v":"Pending"},0,0,{"$f":"IF(SUMPRODUCT($H$48:BZ$48,$H14:BZ14)<0.5, \"Pending\", IF(BZ14<0.5, \"Complete\", \"In Progress\"))","v":"Pending"},0,0,{"$f":"IF(SUMPRODUCT($H$48:CC$48,$H14:CC14)<0.5, \"Pending\", IF(CC14<0.5, \"Complete\", \"In Progress\"))","v":"Pending"},0,0,{"$f":"IF(SUMPRODUCT($H$48:CF$48,$H14:CF14)<0.5, \"Pending\", IF(CF14<0.5, \"Complete\", \"In Progress\"))","v":"Pending"},0,0,{"$f":"IF(SUMPRODUCT($H$48:CI$48,$H14:CI14)<0.5, \"Pending\", IF(CI14<0.5, \"Complete\", \"In Progress\"))","v":"Pending"},0,0,{"$f":"IF(SUMPRODUCT($H$48:CL$48,$H14:CL14)<0.5, \"Pending\", IF(CL14<0.5, \"Complete\", \"In Progress\"))","v":"Pending"},0,0,{"$f":"IF(SUMPRODUCT($H$48:CO$48,$H14:CO14)<0.5, \"Pending\", IF(CO14<0.5, \"Complete\", \"In Progress\"))","v":"Pending"},0,0,{"$f":"IF(SUMPRODUCT($H$48:CR$48,$H14:CR14)<0.5, \"Pending\", IF(CR14<0.5, \"Complete\", \"In Progress\"))","v":"Pending"},0,0,{"$f":"IF(SUMPRODUCT($H$48:CU$48,$H14:CU14)<0.5, \"Pending\", IF(CU14<0.5, \"Complete\", \"In Progress\"))","v":"Pending"},0,0,{"$f":"IF(SUMPRODUCT($H$48:CX$48,$H14:CX14)<0.5, \"Pending\", IF(CX14<0.5, \"Complete\", \"In Progress\"))","v":"Pending"},0,0,{"$f":"IF(SUMPRODUCT($H$48:DA$48,$H14:DA14)<0.5, \"Pending\", IF(DA14<0.5, \"Complete\", \"In Progress\"))","v":"Pending"},0,0,{"$f":"IF(SUMPRODUCT($H$48:DD$48,$H14:DD14)<0.5, \"Pending\", IF(DD14<0.5, \"Complete\", \"In Progress\"))","v":"Pending"},0,0,{"$f":"IF(SUMPRODUCT($H$48:DG$48,$H14:DG14)<0.5, \"Pending\", IF(DG14<0.5, \"Complete\", \"In Progress\"))","v":"Pending"},0,0,{"$f":"IF(SUMPRODUCT($H$48:DJ$48,$H14:DJ14)<0.5, \"Pending\", IF(DJ14<0.5, \"Complete\", \"In Progress\"))","v":"Pending"},0,0,{"$f":"IF(SUMPRODUCT($H$48:DM$48,$H14:DM14)<0.5, \"Pending\", IF(DM14<0.5, \"Complete\", \"In Progress\"))","v":"Pending"},0,0,{"$f":"IF(SUMPRODUCT($H$48:DP$48,$H14:DP14)<0.5, \"Pending\", IF(DP14<0.5, \"Complete\", \"In Progress\"))","v":"Pending"},0,0,{"$f":"IF(SUMPRODUCT($H$48:DS$48,$H14:DS14)<0.5, \"Pending\", IF(DS14<0.5, \"Complete\", \"In Progress\"))","v":"Pending"},0,0,{"$f":"IF(SUMPRODUCT($H$48:DV$48,$H14:DV14)<0.5, \"Pending\", IF(DV14<0.5, \"Complete\", \"In Progress\"))","v":"Pending"},null,{"$f":"SUMPRODUCT($F$48:DE$48,$F14:DE14)","v":0}]
[null,null,null,"unassigned","Pending",1,0,0,0,{"$f":"IF(SUMPRODUCT($H$48:I$48,$H15:I15)<0.5, \"Pending\", IF(I15<0.5, \"Complete\", \"In Progress\"))","v":"Pending"},0,0,{"$f":"IF(SUMPRODUCT($H$48:L$48,$H15:L15)<0.5, \"Pending\", IF(L15<0.5, \"Complete\", \"In Progress\"))","v":"Pending"},0,0,{"$f":"IF(SUMPRODUCT($H$48:O$48,$H15:O15)<0.5, \"Pending\", IF(O15<0.5, \"Complete\", \"In Progress\"))","v":"Pending"},0,0,{"$f":"IF(SUMPRODUCT($H$48:R$48,$H15:R15)<0.5, \"Pending\", IF(R15<0.5, \"Complete\", \"In Progress\"))","v":"Pending"},0,0,{"$f":"IF(SUMPRODUCT($H$48:U$48,$H15:U15)<0.5, \"Pending\", IF(U15<0.5, \"Complete\", \"In Progress\"))","v":"Pending"},0,0,{"$f":"IF(SUMPRODUCT($H$48:X$48,$H15:X15)<0.5, \"Pending\", IF(X15<0.5, \"Complete\", \"In Progress\"))","v":"Pending"},0,0,{"$f":"IF(SUMPRODUCT($H$48:AA$48,$H15:AA15)<0.5, \"Pending\", IF(AA15<0.5, \"Complete\", \"In Progress\"))","v":"Pending"},0,0,{"$f":"IF(SUMPRODUCT($H$48:AD$48,$H15:AD15)<0.5, \"Pending\", IF(AD15<0.5, \"Complete\", \"In Progress\"))","v":"Pending"},0,0,{"$f":"IF(SUMPRODUCT($H$48:AG$48,$H15:AG15)<0.5, \"Pending\", IF(AG15<0.5, \"Complete\", \"In Progress\"))","v":"Pending"},0,0,{"$f":"IF(SUMPRODUCT($H$48:AJ$48,$H15:AJ15)<0.5, \"Pending\", IF(AJ15<0.5, \"Complete\", \"In Progress\"))","v":"Pending"},0,0,{"$f":"IF(SUMPRODUCT($H$48:AM$48,$H15:AM15)<0.5, \"Pending\", IF(AM15<0.5, \"Complete\", \"In Progress\"))","v":"Pending"},0,0,{"$f":"IF(SUMPRODUCT($H$48:AP$48,$H15:AP15)<0.5, \"Pending\", IF(AP15<0.5, \"Complete\", \"In Progress\"))","v":"Pending"},0,0,{"$f":"IF(SUMPRODUCT($H$48:AS$48,$H15:AS15)<0.5, \"Pending\", IF(AS15<0.5, \"Complete\", \"In Progress\"))","v":"Pending"},0,0,{"$f":"IF(SUMPRODUCT($H$48:AV$48,$H15:AV15)<0.5, \"Pending\", IF(AV15<0.5, \"Complete\", \"In Progress\"))","v":"Pending"},0,0,{"$f":"IF(SUMPRODUCT($H$48:AY$48,$H15:AY15)<0.5, \"Pending\", IF(AY15<0.5, \"Complete\", \"In Progress\"))","v":"Pending"},0,0,{"$f":"IF(SUMPRODUCT($H$48:BB$48,$H15:BB15)<0.5, \"Pending\", IF(BB15<0.5, \"Complete\", \"In Progress\"))","v":"Pending"},0,0,{"$f":"IF(SUMPRODUCT($H$48:BE$48,$H15:BE15)<0.5, \"Pending\", IF(BE15<0.5, \"Complete\", \"In Progress\"))","v":"Pending"},0,0,{"$f":"IF(SUMPRODUCT($H$48:BH$48,$H15:BH15)<0.5, \"Pending\", IF(BH15<0.5, \"Complete\", \"In Progress\"))","v":"Pending"},0,0,{"$f":"IF(SUMPRODUCT($H$48:BK$48,$H15:BK15)<0.5, \"Pending\", IF(BK15<0.5, \"Complete\", \"In Progress\"))","v":"Pending"},0,0,{"$f":"IF(SUMPRODUCT($H$48:BN$48,$H15:BN15)<0.5, \"Pending\", IF(BN15<0.5, \"Complete\", \"In Progress\"))","v":"Pending"},0,0,{"$f":"IF(SUMPRODUCT($H$48:BQ$48,$H15:BQ15)<0.5, \"Pending\", IF(BQ15<0.5, \"Complete\", \"In Progress\"))","v":"Pending"},0,0,{"$f":"IF(SUMPRODUCT($H$48:BT$48,$H15:BT15)<0.5, \"Pending\", IF(BT15<0.5, \"Complete\", \"In Progress\"))","v":"Pending"},0,0,{"$f":"IF(SUMPRODUCT($H$48:BW$48,$H15:BW15)<0.5, \"Pending\", IF(BW15<0.5, \"Complete\", \"In Progress\"))","v":"Pending"},0,0,{"$f":"IF(SUMPRODUCT($H$48:BZ$48,$H15:BZ15)<0.5, \"Pending\", IF(BZ15<0.5, \"Complete\", \"In Progress\"))","v":"Pending"},0,0,{"$f":"IF(SUMPRODUCT($H$48:CC$48,$H15:CC15)<0.5, \"Pending\", IF(CC15<0.5, \"Complete\", \"In Progress\"))","v":"Pending"},0,0,{"$f":"IF(SUMPRODUCT($H$48:CF$48,$H15:CF15)<0.5, \"Pending\", IF(CF15<0.5, \"Complete\", \"In Progress\"))","v":"Pending"},0,0,{"$f":"IF(SUMPRODUCT($H$48:CI$48,$H15:CI15)<0.5, \"Pending\", IF(CI15<0.5, \"Complete\", \"In Progress\"))","v":"Pending"},0,0,{"$f":"IF(SUMPRODUCT($H$48:CL$48,$H15:CL15)<0.5, \"Pending\", IF(CL15<0.5, \"Complete\", \"In Progress\"))","v":"Pending"},0,0,{"$f":"IF(SUMPRODUCT($H$48:CO$48,$H15:CO15)<0.5, \"Pending\", IF(CO15<0.5, \"Complete\", \"In Progress\"))","v":"Pending"},0,0,{"$f":"IF(SUMPRODUCT($H$48:CR$48,$H15:CR15)<0.5, \"Pending\", IF(CR15<0.5, \"Complete\", \"In Progress\"))","v":"Pending"},0,0,{"$f":"IF(SUMPRODUCT($H$48:CU$48,$H15:CU15)<0.5, \"Pending\", IF(CU15<0.5, \"Complete\", \"In Progress\"))","v":"Pending"},0,0,{"$f":"IF(SUMPRODUCT($H$48:CX$48,$H15:CX15)<0.5, \"Pending\", IF(CX15<0.5, \"Complete\", \"In Progress\"))","v":"Pending"},0,0,{"$f":"IF(SUMPRODUCT($H$48:DA$48,$H15:DA15)<0.5, \"Pending\", IF(DA15<0.5, \"Complete\", \"In Progress\"))","v":"Pending"},0,0,{"$f":"IF(SUMPRODUCT($H$48:DD$48,$H15:DD15)<0.5, \"Pending\", IF(DD15<0.5, \"Complete\", \"In Progress\"))","v":"Pending"},0,0,{"$f":"IF(SUMPRODUCT($H$48:DG$48,$H15:DG15)<0.5, \"Pending\", IF(DG15<0.5, \"Complete\", \"In Progress\"))","v":"Pending"},0,0,{"$f":"IF(SUMPRODUCT($H$48:DJ$48,$H15:DJ15)<0.5, \"Pending\", IF(DJ15<0.5, \"Complete\", \"In Progress\"))","v":"Pending"},0,0,{"$f":"IF(SUMPRODUCT($H$48:DM$48,$H15:DM15)<0.5, \"Pending\", IF(DM15<0.5, \"Complete\", \"In Progress\"))","v":"Pending"},0,0,{"$f":"IF(SUMPRODUCT($H$48:DP$48,$H15:DP15)<0.5, \"Pending\", IF(DP15<0.5, \"Complete\", \"In Progress\"))","v":"Pending"},0,0,{"$f":"IF(SUMPRODUCT($H$48:DS$48,$H15:DS15)<0.5, \"Pending\", IF(DS15<0.5, \"Complete\", \"In Progress\"))","v":"Pending"},0,0,{"$f":"IF(SUMPRODUCT($H$48:DV$48,$H15:DV15)<0.5, \"Pending\", IF(DV15<0.5, \"Complete\", \"In Progress\"))","v":"Pending"},null,{"$f":"SUMPRODUCT($F$48:DE$48,$F15:DE15)","v":0}]
[null,null,null,"unassigned","Pending",1,0,0,0,{"$f":"IF(SUMPRODUCT($H$48:I$48,$H16:I16)<0.5, \"Pending\", IF(I16<0.5, \"Complete\", \"In Progress\"))","v":"Pending"},0,0,{"$f":"IF(SUMPRODUCT($H$48:L$48,$H16:L16)<0.5, \"Pending\", IF(L16<0.5, \"Complete\", \"In Progress\"))","v":"Pending"},0,0,{"$f":"IF(SUMPRODUCT($H$48:O$48,$H16:O16)<0.5, \"Pending\", IF(O16<0.5, \"Complete\", \"In Progress\"))","v":"Pending"},0,0,{"$f":"IF(SUMPRODUCT($H$48:R$48,$H16:R16)<0.5, \"Pending\", IF(R16<0.5, \"Complete\", \"In Progress\"))","v":"Pending"},0,0,{"$f":"IF(SUMPRODUCT($H$48:U$48,$H16:U16)<0.5, \"Pending\", IF(U16<0.5, \"Complete\", \"In Progress\"))","v":"Pending"},0,0,{"$f":"IF(SUMPRODUCT($H$48:X$48,$H16:X16)<0.5, \"Pending\", IF(X16<0.5, \"Complete\", \"In Progress\"))","v":"Pending"},0,0,{"$f":"IF(SUMPRODUCT($H$48:AA$48,$H16:AA16)<0.5, \"Pending\", IF(AA16<0.5, \"Complete\", \"In Progress\"))","v":"Pending"},0,0,{"$f":"IF(SUMPRODUCT($H$48:AD$48,$H16:AD16)<0.5, \"Pending\", IF(AD16<0.5, \"Complete\", \"In Progress\"))","v":"Pending"},0,0,{"$f":"IF(SUMPRODUCT($H$48:AG$48,$H16:AG16)<0.5, \"Pending\", IF(AG16<0.5, \"Complete\", \"In Progress\"))","v":"Pending"},0,0,{"$f":"IF(SUMPRODUCT($H$48:AJ$48,$H16:AJ16)<0.5, \"Pending\", IF(AJ16<0.5, \"Complete\", \"In Progress\"))","v":"Pending"},0,0,{"$f":"IF(SUMPRODUCT($H$48:AM$48,$H16:AM16)<0.5, \"Pending\", IF(AM16<0.5, \"Complete\", \"In Progress\"))","v":"Pending"},0,0,{"$f":"IF(SUMPRODUCT($H$48:AP$48,$H16:AP16)<0.5, \"Pending\", IF(AP16<0.5, \"Complete\", \"In Progress\"))","v":"Pending"},0,0,{"$f":"IF(SUMPRODUCT($H$48:AS$48,$H16:AS16)<0.5, \"Pending\", IF(AS16<0.5, \"Complete\", \"In Progress\"))","v":"Pending"},0,0,{"$f":"IF(SUMPRODUCT($H$48:AV$48,$H16:AV16)<0.5, \"Pending\", IF(AV16<0.5, \"Complete\", \"In Progress\"))","v":"Pending"},0,0,{"$f":"IF(SUMPRODUCT($H$48:AY$48,$H16:AY16)<0.5, \"Pending\", IF(AY16<0.5, \"Complete\", \"In Progress\"))","v":"Pending"},0,0,{"$f":"IF(SUMPRODUCT($H$48:BB$48,$H16:BB16)<0.5, \"Pending\", IF(BB16<0.5, \"Complete\", \"In Progress\"))","v":"Pending"},0,0,{"$f":"IF(SUMPRODUCT($H$48:BE$48,$H16:BE16)<0.5, \"Pending\", IF(BE16<0.5, \"Complete\", \"In Progress\"))","v":"Pending"},0,0,{"$f":"IF(SUMPRODUCT($H$48:BH$48,$H16:BH16)<0.5, \"Pending\", IF(BH16<0.5, \"Complete\", \"In Progress\"))","v":"Pending"},0,0,{"$f":"IF(SUMPRODUCT($H$48:BK$48,$H16:BK16)<0.5, \"Pending\", IF(BK16<0.5, \"Complete\", \"In Progress\"))","v":"Pending"},0,0,{"$f":"IF(SUMPRODUCT($H$48:BN$48,$H16:BN16)<0.5, \"Pending\", IF(BN16<0.5, \"Complete\", \"In Progress\"))","v":"Pending"},0,0,{"$f":"IF(SUMPRODUCT($H$48:BQ$48,$H16:BQ16)<0.5, \"Pending\", IF(BQ16<0.5, \"Complete\", \"In Progress\"))","v":"Pending"},0,0,{"$f":"IF(SUMPRODUCT($H$48:BT$48,$H16:BT16)<0.5, \"Pending\", IF(BT16<0.5, \"Complete\", \"In Progress\"))","v":"Pending"},0,0,{"$f":"IF(SUMPRODUCT($H$48:BW$48,$H16:BW16)<0.5, \"Pending\", IF(BW16<0.5, \"Complete\", \"In Progress\"))","v":"Pending"},0,0,{"$f":"IF(SUMPRODUCT($H$48:BZ$48,$H16:BZ16)<0.5, \"Pending\", IF(BZ16<0.5, \"Complete\", \"In Progress\"))","v":"Pending"},0,0,{"$f":"IF(SUMPRODUCT($H$48:CC$48,$H16:CC16)<0.5, \"Pending\", IF(CC16<0.5, \"Complete\", \"In Progress\"))","v":"Pending"},0,0,{"$f":"IF(SUMPRODUCT($H$48:CF$48,$H16:CF16)<0.5, \"Pending\", IF(CF16<0.5, \"Complete\", \"In Progress\"))","v":"Pending"},0,0,{"$f":"IF(SUMPRODUCT($H$48:CI$48,$H16:CI16)<0.5, \"Pending\", IF(CI16<0.5, \"Complete\", \"In Progress\"))","v":"Pending"},0,0,{"$f":"IF(SUMPRODUCT($H$48:CL$48,$H16:CL16)<0.5, \"Pending\", IF(CL16<0.5, \"Complete\", \"In Progress\"))","v":"Pending"},0,0,{"$f":"IF(SUMPRODUCT($H$48:CO$48,$H16:CO16)<0.5, \"Pending\", IF(CO16<0.5, \"Complete\", \"In Progress\"))","v":"Pending"},0,0,{"$f":"IF(SUMPRODUCT($H$48:CR$48,$H16:CR16)<0.5, \"Pending\", IF(CR16<0.5, \"Complete\", \"In Progress\"))","v":"Pending"},null,null,null,null,null,null,null,null,null,null,null,null,null,null,null,null,null,null,null,null,null,null,null,null,null,null,null,null,null,null,null,{"$f":"SUMPRODUCT($F$48:DE$48,$F16:DE16)","v":0}]
[null,null,null,"unassigned","Pending",1,0,0,0,{"$f":"IF(SUMPRODUCT($H$48:I$48,$H17:I17)<0.5, \"Pending\", IF(I17<0.5, \"Complete\", \"In Progress\"))","v":"Pending"},0,0,{"$f":"IF(SUMPRODUCT($H$48:L$48,$H17:L17)<0.5, \"Pending\", IF(L17<0.5, \"Complete\", \"In Progress\"))","v":"Pending"},0,0,{"$f":"IF(SUMPRODUCT($H$48:O$48,$H17:O17)<0.5, \"Pending\", IF(O17<0.5, \"Complete\", \"In Progress\"))","v":"Pending"},0,0,{"$f":"IF(SUMPRODUCT($H$48:R$48,$H17:R17)<0.5, \"Pending\", IF(R17<0.5, \"Complete\", \"In Progress\"))","v":"Pending"},0,0,{"$f":"IF(SUMPRODUCT($H$48:U$48,$H17:U17)<0.5, \"Pending\", IF(U17<0.5, \"Complete\", \"In Progress\"))","v":"Pending"},0,0,{"$f":"IF(SUMPRODUCT($H$48:X$48,$H17:X17)<0.5, \"Pending\", IF(X17<0.5, \"Complete\", \"In Progress\"))","v":"Pending"},0,0,{"$f":"IF(SUMPRODUCT($H$48:AA$48,$H17:AA17)<0.5, \"Pending\", IF(AA17<0.5, \"Complete\", \"In Progress\"))","v":"Pending"},0,0,{"$f":"IF(SUMPRODUCT($H$48:AD$48,$H17:AD17)<0.5, \"Pending\", IF(AD17<0.5, \"Complete\", \"In Progress\"))","v":"Pending"},0,0,{"$f":"IF(SUMPRODUCT($H$48:AG$48,$H17:AG17)<0.5, \"Pending\", IF(AG17<0.5, \"Complete\", \"In Progress\"))","v":"Pending"},0,0,{"$f":"IF(SUMPRODUCT($H$48:AJ$48,$H17:AJ17)<0.5, \"Pending\", IF(AJ17<0.5, \"Complete\", \"In Progress\"))","v":"Pending"},0,0,{"$f":"IF(SUMPRODUCT($H$48:AM$48,$H17:AM17)<0.5, \"Pending\", IF(AM17<0.5, \"Complete\", \"In Progress\"))","v":"Pending"},0,0,{"$f":"IF(SUMPRODUCT($H$48:AP$48,$H17:AP17)<0.5, \"Pending\", IF(AP17<0.5, \"Complete\", \"In Progress\"))","v":"Pending"},0,0,{"$f":"IF(SUMPRODUCT($H$48:AS$48,$H17:AS17)<0.5, \"Pending\", IF(AS17<0.5, \"Complete\", \"In Progress\"))","v":"Pending"},0,0,{"$f":"IF(SUMPRODUCT($H$48:AV$48,$H17:AV17)<0.5, \"Pending\", IF(AV17<0.5, \"Complete\", \"In Progress\"))","v":"Pending"},0,0,{"$f":"IF(SUMPRODUCT($H$48:AY$48,$H17:AY17)<0.5, \"Pending\", IF(AY17<0.5, \"Complete\", \"In Progress\"))","v":"Pending"},0,0,{"$f":"IF(SUMPRODUCT($H$48:BB$48,$H17:BB17)<0.5, \"Pending\", IF(BB17<0.5, \"Complete\", \"In Progress\"))","v":"Pending"},0,0,{"$f":"IF(SUMPRODUCT($H$48:BE$48,$H17:BE17)<0.5, \"Pending\", IF(BE17<0.5, \"Complete\", \"In Progress\"))","v":"Pending"},0,0,{"$f":"IF(SUMPRODUCT($H$48:BH$48,$H17:BH17)<0.5, \"Pending\", IF(BH17<0.5, \"Complete\", \"In Progress\"))","v":"Pending"},0,0,{"$f":"IF(SUMPRODUCT($H$48:BK$48,$H17:BK17)<0.5, \"Pending\", IF(BK17<0.5, \"Complete\", \"In Progress\"))","v":"Pending"},0,0,{"$f":"IF(SUMPRODUCT($H$48:BN$48,$H17:BN17)<0.5, \"Pending\", IF(BN17<0.5, \"Complete\", \"In Progress\"))","v":"Pending"},0,0,{"$f":"IF(SUMPRODUCT($H$48:BQ$48,$H17:BQ17)<0.5, \"Pending\", IF(BQ17<0.5, \"Complete\", \"In Progress\"))","v":"Pending"},0,0,{"$f":"IF(SUMPRODUCT($H$48:BT$48,$H17:BT17)<0.5, \"Pending\", IF(BT17<0.5, \"Complete\", \"In Progress\"))","v":"Pending"},0,0,{"$f":"IF(SUMPRODUCT($H$48:BW$48,$H17:BW17)<0.5, \"Pending\", IF(BW17<0.5, \"Complete\", \"In Progress\"))","v":"Pending"},0,0,{"$f":"IF(SUMPRODUCT($H$48:BZ$48,$H17:BZ17)<0.5, \"Pending\", IF(BZ17<0.5, \"Complete\", \"In Progress\"))","v":"Pending"},0,0,{"$f":"IF(SUMPRODUCT($H$48:CC$48,$H17:CC17)<0.5, \"Pending\", IF(CC17<0.5, \"Complete\", \"In Progress\"))","v":"Pending"},0,0,{"$f":"IF(SUMPRODUCT($H$48:CF$48,$H17:CF17)<0.5, \"Pending\", IF(CF17<0.5, \"Complete\", \"In Progress\"))","v":"Pending"},0,0,{"$f":"IF(SUMPRODUCT($H$48:CI$48,$H17:CI17)<0.5, \"Pending\", IF(CI17<0.5, \"Complete\", \"In Progress\"))","v":"Pending"},0,0,{"$f":"IF(SUMPRODUCT($H$48:CL$48,$H17:CL17)<0.5, \"Pending\", IF(CL17<0.5, \"Complete\", \"In Progress\"))","v":"Pending"},0,0,{"$f":"IF(SUMPRODUCT($H$48:CO$48,$H17:CO17)<0.5, \"Pending\", IF(CO17<0.5, \"Complete\", \"In Progress\"))","v":"Pending"},0,0,{"$f":"IF(SUMPRODUCT($H$48:CR$48,$H17:CR17)<0.5, \"Pending\", IF(CR17<0.5, \"Complete\", \"In Progress\"))","v":"Pending"},null,null,null,null,null,null,null,null,null,null,null,null,null,null,null,null,null,null,null,null,null,null,null,null,null,null,null,null,null,null,null,{"$f":"SUMPRODUCT($F$48:DE$48,$F17:DE17)","v":0}]
[null,null,null,"unassigned","Pending",1,0,0,0,{"$f":"IF(SUMPRODUCT($H$48:I$48,$H18:I18)<0.5, \"Pending\", IF(I18<0.5, \"Complete\", \"In Progress\"))","v":"Pending"},0,0,{"$f":"IF(SUMPRODUCT($H$48:L$48,$H18:L18)<0.5, \"Pending\", IF(L18<0.5, \"Complete\", \"In Progress\"))","v":"Pending"},0,0,{"$f":"IF(SUMPRODUCT($H$48:O$48,$H18:O18)<0.5, \"Pending\", IF(O18<0.5, \"Complete\", \"In Progress\"))","v":"Pending"},0,0,{"$f":"IF(SUMPRODUCT($H$48:R$48,$H18:R18)<0.5, \"Pending\", IF(R18<0.5, \"Complete\", \"In Progress\"))","v":"Pending"},0,0,{"$f":"IF(SUMPRODUCT($H$48:U$48,$H18:U18)<0.5, \"Pending\", IF(U18<0.5, \"Complete\", \"In Progress\"))","v":"Pending"},0,0,{"$f":"IF(SUMPRODUCT($H$48:X$48,$H18:X18)<0.5, \"Pending\", IF(X18<0.5, \"Complete\", \"In Progress\"))","v":"Pending"},0,0,{"$f":"IF(SUMPRODUCT($H$48:AA$48,$H18:AA18)<0.5, \"Pending\", IF(AA18<0.5, \"Complete\", \"In Progress\"))","v":"Pending"},0,0,{"$f":"IF(SUMPRODUCT($H$48:AD$48,$H18:AD18)<0.5, \"Pending\", IF(AD18<0.5, \"Complete\", \"In Progress\"))","v":"Pending"},0,0,{"$f":"IF(SUMPRODUCT($H$48:AG$48,$H18:AG18)<0.5, \"Pending\", IF(AG18<0.5, \"Complete\", \"In Progress\"))","v":"Pending"},0,0,{"$f":"IF(SUMPRODUCT($H$48:AJ$48,$H18:AJ18)<0.5, \"Pending\", IF(AJ18<0.5, \"Complete\", \"In Progress\"))","v":"Pending"},0,0,{"$f":"IF(SUMPRODUCT($H$48:AM$48,$H18:AM18)<0.5, \"Pending\", IF(AM18<0.5, \"Complete\", \"In Progress\"))","v":"Pending"},0,0,{"$f":"IF(SUMPRODUCT($H$48:AP$48,$H18:AP18)<0.5, \"Pending\", IF(AP18<0.5, \"Complete\", \"In Progress\"))","v":"Pending"},0,0,{"$f":"IF(SUMPRODUCT($H$48:AS$48,$H18:AS18)<0.5, \"Pending\", IF(AS18<0.5, \"Complete\", \"In Progress\"))","v":"Pending"},0,0,{"$f":"IF(SUMPRODUCT($H$48:AV$48,$H18:AV18)<0.5, \"Pending\", IF(AV18<0.5, \"Complete\", \"In Progress\"))","v":"Pending"},0,0,{"$f":"IF(SUMPRODUCT($H$48:AY$48,$H18:AY18)<0.5, \"Pending\", IF(AY18<0.5, \"Complete\", \"In Progress\"))","v":"Pending"},0,0,{"$f":"IF(SUMPRODUCT($H$48:BB$48,$H18:BB18)<0.5, \"Pending\", IF(BB18<0.5, \"Complete\", \"In Progress\"))","v":"Pending"},0,0,{"$f":"IF(SUMPRODUCT($H$48:BE$48,$H18:BE18)<0.5, \"Pending\", IF(BE18<0.5, \"Complete\", \"In Progress\"))","v":"Pending"},0,0,{"$f":"IF(SUMPRODUCT($H$48:BH$48,$H18:BH18)<0.5, \"Pending\", IF(BH18<0.5, \"Complete\", \"In Progress\"))","v":"Pending"},0,0,{"$f":"IF(SUMPRODUCT($H$48:BK$48,$H18:BK18)<0.5, \"Pending\", IF(BK18<0.5, \"Complete\", \"In Progress\"))","v":"Pending"},0,0,{"$f":"IF(SUMPRODUCT($H$48:BN$48,$H18:BN18)<0.5, \"Pending\", IF(BN18<0.5, \"Complete\", \"In Progress\"))","v":"Pending"},0,0,{"$f":"IF(SUMPRODUCT($H$48:BQ$48,$H18:BQ18)<0.5, \"Pending\", IF(BQ18<0.5, \"Complete\", \"In Progress\"))","v":"Pending"},0,0,{"$f":"IF(SUMPRODUCT($H$48:BT$48,$H18:BT18)<0.5, \"Pending\", IF(BT18<0.5, \"Complete\", \"In Progress\"))","v":"Pending"},0,0,{"$f":"IF(SUMPRODUCT($H$48:BW$48,$H18:BW18)<0.5, \"Pending\", IF(BW18<0.5, \"Complete\", \"In Progress\"))","v":"Pending"},0,0,{"$f":"IF(SUMPRODUCT($H$48:BZ$48,$H18:BZ18)<0.5, \"Pending\", IF(BZ18<0.5, \"Complete\", \"In Progress\"))","v":"Pending"},0,0,{"$f":"IF(SUMPRODUCT($H$48:CC$48,$H18:CC18)<0.5, \"Pending\", IF(CC18<0.5, \"Complete\", \"In Progress\"))","v":"Pending"},0,0,{"$f":"IF(SUMPRODUCT($H$48:CF$48,$H18:CF18)<0.5, \"Pending\", IF(CF18<0.5, \"Complete\", \"In Progress\"))","v":"Pending"},0,0,{"$f":"IF(SUMPRODUCT($H$48:CI$48,$H18:CI18)<0.5, \"Pending\", IF(CI18<0.5, \"Complete\", \"In Progress\"))","v":"Pending"},0,0,{"$f":"IF(SUMPRODUCT($H$48:CL$48,$H18:CL18)<0.5, \"Pending\", IF(CL18<0.5, \"Complete\", \"In Progress\"))","v":"Pending"},0,0,{"$f":"IF(SUMPRODUCT($H$48:CO$48,$H18:CO18)<0.5, \"Pending\", IF(CO18<0.5, \"Complete\", \"In Progress\"))","v":"Pending"},0,0,{"$f":"IF(SUMPRODUCT($H$48:CR$48,$H18:CR18)<0.5, \"Pending\", IF(CR18<0.5, \"Complete\", \"In Progress\"))","v":"Pending"},null,null,null,null,null,null,null,null,null,null,null,null,null,null,null,null,null,null,null,null,null,null,null,null,null,null,null,null,null,null,null,{"$f":"SUMPRODUCT($F$48:DE$48,$F18:DE18)","v":0}]
[null,null,null,"unassigned","Pending",1,0,0,0,{"$f":"IF(SUMPRODUCT($H$48:I$48,$H19:I19)<0.5, \"Pending\", IF(I19<0.5, \"Complete\", \"In Progress\"))","v":"Pending"},0,0,{"$f":"IF(SUMPRODUCT($H$48:L$48,$H19:L19)<0.5, \"Pending\", IF(L19<0.5, \"Complete\", \"In Progress\"))","v":"Pending"},0,0,{"$f":"IF(SUMPRODUCT($H$48:O$48,$H19:O19)<0.5, \"Pending\", IF(O19<0.5, \"Complete\", \"In Progress\"))","v":"Pending"},0,0,{"$f":"IF(SUMPRODUCT($H$48:R$48,$H19:R19)<0.5, \"Pending\", IF(R19<0.5, \"Complete\", \"In Progress\"))","v":"Pending"},0,0,{"$f":"IF(SUMPRODUCT($H$48:U$48,$H19:U19)<0.5, \"Pending\", IF(U19<0.5, \"Complete\", \"In Progress\"))","v":"Pending"},0,0,{"$f":"IF(SUMPRODUCT($H$48:X$48,$H19:X19)<0.5, \"Pending\", IF(X19<0.5, \"Complete\", \"In Progress\"))","v":"Pending"},0,0,{"$f":"IF(SUMPRODUCT($H$48:AA$48,$H19:AA19)<0.5, \"Pending\", IF(AA19<0.5, \"Complete\", \"In Progress\"))","v":"Pending"},0,0,{"$f":"IF(SUMPRODUCT($H$48:AD$48,$H19:AD19)<0.5, \"Pending\", IF(AD19<0.5, \"Complete\", \"In Progress\"))","v":"Pending"},0,0,{"$f":"IF(SUMPRODUCT($H$48:AG$48,$H19:AG19)<0.5, \"Pending\", IF(AG19<0.5, \"Complete\", \"In Progress\"))","v":"Pending"},0,0,{"$f":"IF(SUMPRODUCT($H$48:AJ$48,$H19:AJ19)<0.5, \"Pending\", IF(AJ19<0.5, \"Complete\", \"In Progress\"))","v":"Pending"},0,0,{"$f":"IF(SUMPRODUCT($H$48:AM$48,$H19:AM19)<0.5, \"Pending\", IF(AM19<0.5, \"Complete\", \"In Progress\"))","v":"Pending"},0,0,{"$f":"IF(SUMPRODUCT($H$48:AP$48,$H19:AP19)<0.5, \"Pending\", IF(AP19<0.5, \"Complete\", \"In Progress\"))","v":"Pending"},0,0,{"$f":"IF(SUMPRODUCT($H$48:AS$48,$H19:AS19)<0.5, \"Pending\", IF(AS19<0.5, \"Complete\", \"In Progress\"))","v":"Pending"},0,0,{"$f":"IF(SUMPRODUCT($H$48:AV$48,$H19:AV19)<0.5, \"Pending\", IF(AV19<0.5, \"Complete\", \"In Progress\"))","v":"Pending"},0,0,{"$f":"IF(SUMPRODUCT($H$48:AY$48,$H19:AY19)<0.5, \"Pending\", IF(AY19<0.5, \"Complete\", \"In Progress\"))","v":"Pending"},0,0,{"$f":"IF(SUMPRODUCT($H$48:BB$48,$H19:BB19)<0.5, \"Pending\", IF(BB19<0.5, \"Complete\", \"In Progress\"))","v":"Pending"},0,0,{"$f":"IF(SUMPRODUCT($H$48:BE$48,$H19:BE19)<0.5, \"Pending\", IF(BE19<0.5, \"Complete\", \"In Progress\"))","v":"Pending"},0,0,{"$f":"IF(SUMPRODUCT($H$48:BH$48,$H19:BH19)<0.5, \"Pending\", IF(BH19<0.5, \"Complete\", \"In Progress\"))","v":"Pending"},0,0,{"$f":"IF(SUMPRODUCT($H$48:BK$48,$H19:BK19)<0.5, \"Pending\", IF(BK19<0.5, \"Complete\", \"In Progress\"))","v":"Pending"},0,0,{"$f":"IF(SUMPRODUCT($H$48:BN$48,$H19:BN19)<0.5, \"Pending\", IF(BN19<0.5, \"Complete\", \"In Progress\"))","v":"Pending"},0,0,{"$f":"IF(SUMPRODUCT($H$48:BQ$48,$H19:BQ19)<0.5, \"Pending\", IF(BQ19<0.5, \"Complete\", \"In Progress\"))","v":"Pending"},0,0,{"$f":"IF(SUMPRODUCT($H$48:BT$48,$H19:BT19)<0.5, \"Pending\", IF(BT19<0.5, \"Complete\", \"In Progress\"))","v":"Pending"},0,0,{"$f":"IF(SUMPRODUCT($H$48:BW$48,$H19:BW19)<0.5, \"Pending\", IF(BW19<0.5, \"Complete\", \"In Progress\"))","v":"Pending"},0,0,{"$f":"IF(SUMPRODUCT($H$48:BZ$48,$H19:BZ19)<0.5, \"Pending\", IF(BZ19<0.5, \"Complete\", \"In Progress\"))","v":"Pending"},0,0,{"$f":"IF(SUMPRODUCT($H$48:CC$48,$H19:CC19)<0.5, \"Pending\", IF(CC19<0.5, \"Complete\", \"In Progress\"))","v":"Pending"},0,0,{"$f":"IF(SUMPRODUCT($H$48:CF$48,$H19:CF19)<0.5, \"Pending\", IF(CF19<0.5, \"Complete\", \"In Progress\"))","v":"Pending"},0,0,{"$f":"IF(SUMPRODUCT($H$48:CI$48,$H19:CI19)<0.5, \"Pending\", IF(CI19<0.5, \"Complete\", \"In Progress\"))","v":"Pending"},0,0,{"$f":"IF(SUMPRODUCT($H$48:CL$48,$H19:CL19)<0.5, \"Pending\", IF(CL19<0.5, \"Complete\", \"In Progress\"))","v":"Pending"},0,0,{"$f":"IF(SUMPRODUCT($H$48:CO$48,$H19:CO19)<0.5, \"Pending\", IF(CO19<0.5, \"Complete\", \"In Progress\"))","v":"Pending"},0,0,{"$f":"IF(SUMPRODUCT($H$48:CR$48,$H19:CR19)<0.5, \"Pending\", IF(CR19<0.5, \"Complete\", \"In Progress\"))","v":"Pending"},null,null,null,null,null,null,null,null,null,null,null,null,null,null,null,null,null,null,null,null,null,null,null,null,null,null,null,null,null,null,null,{"$f":"SUMPRODUCT($F$48:DE$48,$F19:DE19)","v":0}]
[null,null,null,"unassigned","Pending",1,0,0,0,{"$f":"IF(SUMPRODUCT($H$48:I$48,$H20:I20)<0.5, \"Pending\", IF(I20<0.5, \"Complete\", \"In Progress\"))","v":"Pending"},0,0,{"$f":"IF(SUMPRODUCT($H$48:L$48,$H20:L20)<0.5, \"Pending\", IF(L20<0.5, \"Complete\", \"In Progress\"))","v":"Pending"},0,0,{"$f":"IF(SUMPRODUCT($H$48:O$48,$H20:O20)<0.5, \"Pending\", IF(O20<0.5, \"Complete\", \"In Progress\"))","v":"Pending"},0,0,{"$f":"IF(SUMPRODUCT($H$48:R$48,$H20:R20)<0.5, \"Pending\", IF(R20<0.5, \"Complete\", \"In Progress\"))","v":"Pending"},0,0,{"$f":"IF(SUMPRODUCT($H$48:U$48,$H20:U20)<0.5, \"Pending\", IF(U20<0.5, \"Complete\", \"In Progress\"))","v":"Pending"},0,0,{"$f":"IF(SUMPRODUCT($H$48:X$48,$H20:X20)<0.5, \"Pending\", IF(X20<0.5, \"Complete\", \"In Progress\"))","v":"Pending"},0,0,{"$f":"IF(SUMPRODUCT($H$48:AA$48,$H20:AA20)<0.5, \"Pending\", IF(AA20<0.5, \"Complete\", \"In Progress\"))","v":"Pending"},0,0,{"$f":"IF(SUMPRODUCT($H$48:AD$48,$H20:AD20)<0.5, \"Pending\", IF(AD20<0.5, \"Complete\", \"In Progress\"))","v":"Pending"},0,0,{"$f":"IF(SUMPRODUCT($H$48:AG$48,$H20:AG20)<0.5, \"Pending\", IF(AG20<0.5, \"Complete\", \"In Progress\"))","v":"Pending"},0,0,{"$f":"IF(SUMPRODUCT($H$48:AJ$48,$H20:AJ20)<0.5, \"Pending\", IF(AJ20<0.5, \"Complete\", \"In Progress\"))","v":"Pending"},0,0,{"$f":"IF(SUMPRODUCT($H$48:AM$48,$H20:AM20)<0.5, \"Pending\", IF(AM20<0.5, \"Complete\", \"In Progress\"))","v":"Pending"},0,0,{"$f":"IF(SUMPRODUCT($H$48:AP$48,$H20:AP20)<0.5, \"Pending\", IF(AP20<0.5, \"Complete\", \"In Progress\"))","v":"Pending"},0,0,{"$f":"IF(SUMPRODUCT($H$48:AS$48,$H20:AS20)<0.5, \"Pending\", IF(AS20<0.5, \"Complete\", \"In Progress\"))","v":"Pending"},0,0,{"$f":"IF(SUMPRODUCT($H$48:AV$48,$H20:AV20)<0.5, \"Pending\", IF(AV20<0.5, \"Complete\", \"In Progress\"))","v":"Pending"},0,0,{"$f":"IF(SUMPRODUCT($H$48:AY$48,$H20:AY20)<0.5, \"Pending\", IF(AY20<0.5, \"Complete\", \"In Progress\"))","v":"Pending"},0,0,{"$f":"IF(SUMPRODUCT($H$48:BB$48,$H20:BB20)<0.5, \"Pending\", IF(BB20<0.5, \"Complete\", \"In Progress\"))","v":"Pending"},0,0,{"$f":"IF(SUMPRODUCT($H$48:BE$48,$H20:BE20)<0.5, \"Pending\", IF(BE20<0.5, \"Complete\", \"In Progress\"))","v":"Pending"},0,0,{"$f":"IF(SUMPRODUCT($H$48:BH$48,$H20:BH20)<0.5, \"Pending\", IF(BH20<0.5, \"Complete\", \"In Progress\"))","v":"Pending"},0,0,{"$f":"IF(SUMPRODUCT($H$48:BK$48,$H20:BK20)<0.5, \"Pending\", IF(BK20<0.5, \"Complete\", \"In Progress\"))","v":"Pending"},0,0,{"$f":"IF(SUMPRODUCT($H$48:BN$48,$H20:BN20)<0.5, \"Pending\", IF(BN20<0.5, \"Complete\", \"In Progress\"))","v":"Pending"},0,0,{"$f":"IF(SUMPRODUCT($H$48:BQ$48,$H20:BQ20)<0.5, \"Pending\", IF(BQ20<0.5, \"Complete\", \"In Progress\"))","v":"Pending"},0,0,{"$f":"IF(SUMPRODUCT($H$48:BT$48,$H20:BT20)<0.5, \"Pending\", IF(BT20<0.5, \"Complete\", \"In Progress\"))","v":"Pending"},0,0,{"$f":"IF(SUMPRODUCT($H$48:BW$48,$H20:BW20)<0.5, \"Pending\", IF(BW20<0.5, \"Complete\", \"In Progress\"))","v":"Pending"},0,0,{"$f":"IF(SUMPRODUCT($H$48:BZ$48,$H20:BZ20)<0.5, \"Pending\", IF(BZ20<0.5, \"Complete\", \"In Progress\"))","v":"Pending"},0,0,{"$f":"IF(SUMPRODUCT($H$48:CC$48,$H20:CC20)<0.5, \"Pending\", IF(CC20<0.5, \"Complete\", \"In Progress\"))","v":"Pending"},0,0,{"$f":"IF(SUMPRODUCT($H$48:CF$48,$H20:CF20)<0.5, \"Pending\", IF(CF20<0.5, \"Complete\", \"In Progress\"))","v":"Pending"},0,0,{"$f":"IF(SUMPRODUCT($H$48:CI$48,$H20:CI20)<0.5, \"Pending\", IF(CI20<0.5, \"Complete\", \"In Progress\"))","v":"Pending"},0,0,{"$f":"IF(SUMPRODUCT($H$48:CL$48,$H20:CL20)<0.5, \"Pending\", IF(CL20<0.5, \"Complete\", \"In Progress\"))","v":"Pending"},0,0,{"$f":"IF(SUMPRODUCT($H$48:CO$48,$H20:CO20)<0.5, \"Pending\", IF(CO20<0.5, \"Complete\", \"In Progress\"))","v":"Pending"},0,0,{"$f":"IF(SUMPRODUCT($H$48:CR$48,$H20:CR20)<0.5, \"Pending\", IF(CR20<0.5, \"Complete\", \"In Progress\"))","v":"Pending"},0,{"$f":"MAX(CR20-CT20,0)","v":0},{"$f":"IF(SUMPRODUCT($H$48:CU$48,$H20:CU20)<0.5, \"Pending\", IF(CU20<0.5, \"Complete\", \"In Progress\"))","v":"Pending"},0,{"$f":"MAX(CU20-CW20,0)","v":0},{"$f":"IF(SUMPRODUCT($H$48:CX$48,$H20:CX20)<0.5, \"Pending\", IF(CX20<0.5, \"Complete\", \"In Progress\"))","v":"Pending"},0,{"$f":"MAX(CX20-CZ20,0)","v":0},{"$f":"IF(SUMPRODUCT($H$48:DA$48,$H20:DA20)<0.5, \"Pending\", IF(DA20<0.5, \"Complete\", \"In Progress\"))","v":"Pending"},0,{"$f":"MAX(DA20-DC20,0)","v":0},{"$f":"IF(SUMPRODUCT($H$48:DD$48,$H20:DD20)<0.5, \"Pending\", IF(DD20<0.5, \"Complete\", \"In Progress\"))","v":"Pending"},0,{"$f":"MAX(DD20-DF20,0)","v":0},{"$f":"IF(SUMPRODUCT($H$48:DG$48,$H20:DG20)<0.5, \"Pending\", IF(DG20<0.5, \"Complete\", \"In Progress\"))","v":"Pending"},0,{"$f":"MAX(DG20-DI20,0)","v":0},{"$f":"IF(SUMPRODUCT($H$48:DJ$48,$H20:DJ20)<0.5, \"Pending\", IF(DJ20<0.5, \"Complete\", \"In Progress\"))","v":"Pending"},0,{"$f":"MAX(DJ20-DL20,0)","v":0},{"$f":"IF(SUMPRODUCT($H$48:DM$48,$H20:DM20)<0.5, \"Pending\", IF(DM20<0.5, \"Complete\", \"In Progress\"))","v":"Pending"},0,{"$f":"MAX(DM20-DO20,0)","v":0},{"$f":"IF(SUMPRODUCT($H$48:DP$48,$H20:DP20)<0.5, \"Pending\", IF(DP20<0.5, \"Complete\", \"In Progress\"))","v":"Pending"},0,{"$f":"MAX(DP20-DR20,0)","v":0},{"$f":"IF(SUMPRODUCT($H$48:DS$48,$H20:DS20)<0.5, \"Pending\", IF(DS20<0.5, \"Complete\", \"In Progress\"))","v":"Pending"},0,{"$f":"MAX(DS20-DU20,0)","v":0},{"$f":"IF(SUMPRODUCT($H$48:DV$48,$H20:DV20)<0.5, \"Pending\", IF(DV20<0.5, \"Complete\", \"In Progress\"))","v":"Pending"},null,{"$f":"SUMPRODUCT($F$48:DE$48,$F20:DE20)","v":0}]
[null,null,null,"unassigned","Pending",1,0,0,0,{"$f":"IF(SUMPRODUCT($H$48:I$48,$H21:I21)<0.5, \"Pending\", IF(I21<0.5, \"Complete\", \"In Progress\"))","v":"Pending"},0,0,{"$f":"IF(SUMPRODUCT($H$48:L$48,$H21:L21)<0.5, \"Pending\", IF(L21<0.5, \"Complete\", \"In Progress\"))","v":"Pending"},0,0,{"$f":"IF(SUMPRODUCT($H$48:O$48,$H21:O21)<0.5, \"Pending\", IF(O21<0.5, \"Complete\", \"In Progress\"))","v":"Pending"},0,0,{"$f":"IF(SUMPRODUCT($H$48:R$48,$H21:R21)<0.5, \"Pending\", IF(R21<0.5, \"Complete\", \"In Progress\"))","v":"Pending"},0,0,{"$f":"IF(SUMPRODUCT($H$48:U$48,$H21:U21)<0.5, \"Pending\", IF(U21<0.5, \"Complete\", \"In Progress\"))","v":"Pending"},0,0,{"$f":"IF(SUMPRODUCT($H$48:X$48,$H21:X21)<0.5, \"Pending\", IF(X21<0.5, \"Complete\", \"In Progress\"))","v":"Pending"},0,0,{"$f":"IF(SUMPRODUCT($H$48:AA$48,$H21:AA21)<0.5, \"Pending\", IF(AA21<0.5, \"Complete\", \"In Progress\"))","v":"Pending"},0,0,{"$f":"IF(SUMPRODUCT($H$48:AD$48,$H21:AD21)<0.5, \"Pending\", IF(AD21<0.5, \"Complete\", \"In Progress\"))","v":"Pending"},0,0,{"$f":"IF(SUMPRODUCT($H$48:AG$48,$H21:AG21)<0.5, \"Pending\", IF(AG21<0.5, \"Complete\", \"In Progress\"))","v":"Pending"},0,0,{"$f":"IF(SUMPRODUCT($H$48:AJ$48,$H21:AJ21)<0.5, \"Pending\", IF(AJ21<0.5, \"Complete\", \"In Progress\"))","v":"Pending"},0,0,{"$f":"IF(SUMPRODUCT($H$48:AM$48,$H21:AM21)<0.5, \"Pending\", IF(AM21<0.5, \"Complete\", \"In Progress\"))","v":"Pending"},0,0,{"$f":"IF(SUMPRODUCT($H$48:AP$48,$H21:AP21)<0.5, \"Pending\", IF(AP21<0.5, \"Complete\", \"In Progress\"))","v":"Pending"},0,0,{"$f":"IF(SUMPRODUCT($H$48:AS$48,$H21:AS21)<0.5, \"Pending\", IF(AS21<0.5, \"Complete\", \"In Progress\"))","v":"Pending"},0,0,{"$f":"IF(SUMPRODUCT($H$48:AV$48,$H21:AV21)<0.5, \"Pending\", IF(AV21<0.5, \"Complete\", \"In Progress\"))","v":"Pending"},0,0,{"$f":"IF(SUMPRODUCT($H$48:AY$48,$H21:AY21)<0.5, \"Pending\", IF(AY21<0.5, \"Complete\", \"In Progress\"))","v":"Pending"},0,0,{"$f":"IF(SUMPRODUCT($H$48:BB$48,$H21:BB21)<0.5, \"Pending\", IF(BB21<0.5, \"Complete\", \"In Progress\"))","v":"Pending"},0,0,{"$f":"IF(SUMPRODUCT($H$48:BE$48,$H21:BE21)<0.5, \"Pending\", IF(BE21<0.5, \"Complete\", \"In Progress\"))","v":"Pending"},0,0,{"$f":"IF(SUMPRODUCT($H$48:BH$48,$H21:BH21)<0.5, \"Pending\", IF(BH21<0.5, \"Complete\", \"In Progress\"))","v":"Pending"},0,0,{"$f":"IF(SUMPRODUCT($H$48:BK$48,$H21:BK21)<0.5, \"Pending\", IF(BK21<0.5, \"Complete\", \"In Progress\"))","v":"Pending"},0,0,{"$f":"IF(SUMPRODUCT($H$48:BN$48,$H21:BN21)<0.5, \"Pending\", IF(BN21<0.5, \"Complete\", \"In Progress\"))","v":"Pending"},0,0,{"$f":"IF(SUMPRODUCT($H$48:BQ$48,$H21:BQ21)<0.5, \"Pending\", IF(BQ21<0.5, \"Complete\", \"In Progress\"))","v":"Pending"},0,0,{"$f":"IF(SUMPRODUCT($H$48:BT$48,$H21:BT21)<0.5, \"Pending\", IF(BT21<0.5, \"Complete\", \"In Progress\"))","v":"Pending"},0,0,{"$f":"IF(SUMPRODUCT($H$48:BW$48,$H21:BW21)<0.5, \"Pending\", IF(BW21<0.5, \"Complete\", \"In Progress\"))","v":"Pending"},0,0,{"$f":"IF(SUMPRODUCT($H$48:BZ$48,$H21:BZ21)<0.5, \"Pending\", IF(BZ21<0.5, \"Complete\", \"In Progress\"))","v":"Pending"},0,0,{"$f":"IF(SUMPRODUCT($H$48:CC$48,$H21:CC21)<0.5, \"Pending\", IF(CC21<0.5, \"Complete\", \"In Progress\"))","v":"Pending"},0,0,{"$f":"IF(SUMPRODUCT($H$48:CF$48,$H21:CF21)<0.5, \"Pending\", IF(CF21<0.5, \"Complete\", \"In Progress\"))","v":"Pending"},0,0,{"$f":"IF(SUMPRODUCT($H$48:CI$48,$H21:CI21)<0.5, \"Pending\", IF(CI21<0.5, \"Complete\", \"In Progress\"))","v":"Pending"},0,0,{"$f":"IF(SUMPRODUCT($H$48:CL$48,$H21:CL21)<0.5, \"Pending\", IF(CL21<0.5, \"Complete\", \"In Progress\"))","v":"Pending"},0,0,{"$f":"IF(SUMPRODUCT($H$48:CO$48,$H21:CO21)<0.5, \"Pending\", IF(CO21<0.5, \"Complete\", \"In Progress\"))","v":"Pending"},0,0,{"$f":"IF(SUMPRODUCT($H$48:CR$48,$H21:CR21)<0.5, \"Pending\", IF(CR21<0.5, \"Complete\", \"In Progress\"))","v":"Pending"},0,0,{"$f":"IF(SUMPRODUCT($H$48:CU$48,$H21:CU21)<0.5, \"Pending\", IF(CU21<0.5, \"Complete\", \"In Progress\"))","v":"Pending"},0,0,{"$f":"IF(SUMPRODUCT($H$48:CX$48,$H21:CX21)<0.5, \"Pending\", IF(CX21<0.5, \"Complete\", \"In Progress\"))","v":"Pending"},0,0,{"$f":"IF(SUMPRODUCT($H$48:DA$48,$H21:DA21)<0.5, \"Pending\", IF(DA21<0.5, \"Complete\", \"In Progress\"))","v":"Pending"},0,0,{"$f":"IF(SUMPRODUCT($H$48:DD$48,$H21:DD21)<0.5, \"Pending\", IF(DD21<0.5, \"Complete\", \"In Progress\"))","v":"Pending"},0,0,{"$f":"IF(SUMPRODUCT($H$48:DG$48,$H21:DG21)<0.5, \"Pending\", IF(DG21<0.5, \"Complete\", \"In Progress\"))","v":"Pending"},0,0,{"$f":"IF(SUMPRODUCT($H$48:DJ$48,$H21:DJ21)<0.5, \"Pending\", IF(DJ21<0.5, \"Complete\", \"In Progress\"))","v":"Pending"},0,0,{"$f":"IF(SUMPRODUCT($H$48:DM$48,$H21:DM21)<0.5, \"Pending\", IF(DM21<0.5, \"Complete\", \"In Progress\"))","v":"Pending"},0,0,{"$f":"IF(SUMPRODUCT($H$48:DP$48,$H21:DP21)<0.5, \"Pending\", IF(DP21<0.5, \"Complete\", \"In Progress\"))","v":"Pending"},0,0,{"$f":"IF(SUMPRODUCT($H$48:DS$48,$H21:DS21)<0.5, \"Pending\", IF(DS21<0.5, \"Complete\", \"In Progress\"))","v":"Pending"},0,0,{"$f":"IF(SUMPRODUCT($H$48:DV$48,$H21:DV21)<0.5, \"Pending\", IF(DV21<0.5, \"Complete\", \"In Progress\"))","v":"Pending"},null,{"$f":"SUMPRODUCT($F$48:DE$48,$F21:DE21)","v":0}]
[null,null,null,"unassigned","Pending",1,0,0,0,{"$f":"IF(SUMPRODUCT($H$48:I$48,$H22:I22)<0.5, \"Pending\", IF(I22<0.5, \"Complete\", \"In Progress\"))","v":"Pending"},0,0,{"$f":"IF(SUMPRODUCT($H$48:L$48,$H22:L22)<0.5, \"Pending\", IF(L22<0.5, \"Complete\", \"In Progress\"))","v":"Pending"},0,0,{"$f":"IF(SUMPRODUCT($H$48:O$48,$H22:O22)<0.5, \"Pending\", IF(O22<0.5, \"Complete\", \"In Progress\"))","v":"Pending"},0,0,{"$f":"IF(SUMPRODUCT($H$48:R$48,$H22:R22)<0.5, \"Pending\", IF(R22<0.5, \"Complete\", \"In Progress\"))","v":"Pending"},0,0,{"$f":"IF(SUMPRODUCT($H$48:U$48,$H22:U22)<0.5, \"Pending\", IF(U22<0.5, \"Complete\", \"In Progress\"))","v":"Pending"},0,0,{"$f":"IF(SUMPRODUCT($H$48:X$48,$H22:X22)<0.5, \"Pending\", IF(X22<0.5, \"Complete\", \"In Progress\"))","v":"Pending"},0,0,{"$f":"IF(SUMPRODUCT($H$48:AA$48,$H22:AA22)<0.5, \"Pending\", IF(AA22<0.5, \"Complete\", \"In Progress\"))","v":"Pending"},0,0,{"$f":"IF(SUMPRODUCT($H$48:AD$48,$H22:AD22)<0.5, \"Pending\", IF(AD22<0.5, \"Complete\", \"In Progress\"))","v":"Pending"},0,0,{"$f":"IF(SUMPRODUCT($H$48:AG$48,$H22:AG22)<0.5, \"Pending\", IF(AG22<0.5, \"Complete\", \"In Progress\"))","v":"Pending"},0,0,{"$f":"IF(SUMPRODUCT($H$48:AJ$48,$H22:AJ22)<0.5, \"Pending\", IF(AJ22<0.5, \"Complete\", \"In Progress\"))","v":"Pending"},0,0,{"$f":"IF(SUMPRODUCT($H$48:AM$48,$H22:AM22)<0.5, \"Pending\", IF(AM22<0.5, \"Complete\", \"In Progress\"))","v":"Pending"},0,0,{"$f":"IF(SUMPRODUCT($H$48:AP$48,$H22:AP22)<0.5, \"Pending\", IF(AP22<0.5, \"Complete\", \"In Progress\"))","v":"Pending"},0,0,{"$f":"IF(SUMPRODUCT($H$48:AS$48,$H22:AS22)<0.5, \"Pending\", IF(AS22<0.5, \"Complete\", \"In Progress\"))","v":"Pending"},0,0,{"$f":"IF(SUMPRODUCT($H$48:AV$48,$H22:AV22)<0.5, \"Pending\", IF(AV22<0.5, \"Complete\", \"In Progress\"))","v":"Pending"},0,0,{"$f":"IF(SUMPRODUCT($H$48:AY$48,$H22:AY22)<0.5, \"Pending\", IF(AY22<0.5, \"Complete\", \"In Progress\"))","v":"Pending"},0,0,{"$f":"IF(SUMPRODUCT($H$48:BB$48,$H22:BB22)<0.5, \"Pending\", IF(BB22<0.5, \"Complete\", \"In Progress\"))","v":"Pending"},0,0,{"$f":"IF(SUMPRODUCT($H$48:BE$48,$H22:BE22)<0.5, \"Pending\", IF(BE22<0.5, \"Complete\", \"In Progress\"))","v":"Pending"},0,0,{"$f":"IF(SUMPRODUCT($H$48:BH$48,$H22:BH22)<0.5, \"Pending\", IF(BH22<0.5, \"Complete\", \"In Progress\"))","v":"Pending"},0,0,{"$f":"IF(SUMPRODUCT($H$48:BK$48,$H22:BK22)<0.5, \"Pending\", IF(BK22<0.5, \"Complete\", \"In Progress\"))","v":"Pending"},0,0,{"$f":"IF(SUMPRODUCT($H$48:BN$48,$H22:BN22)<0.5, \"Pending\", IF(BN22<0.5, \"Complete\", \"In Progress\"))","v":"Pending"},0,0,{"$f":"IF(SUMPRODUCT($H$48:BQ$48,$H22:BQ22)<0.5, \"Pending\", IF(BQ22<0.5, \"Complete\", \"In Progress\"))","v":"Pending"},0,0,{"$f":"IF(SUMPRODUCT($H$48:BT$48,$H22:BT22)<0.5, \"Pending\", IF(BT22<0.5, \"Complete\", \"In Progress\"))","v":"Pending"},0,0,{"$f":"IF(SUMPRODUCT($H$48:BW$48,$H22:BW22)<0.5, \"Pending\", IF(BW22<0.5, \"Complete\", \"In Progress\"))","v":"Pending"},0,0,{"$f":"IF(SUMPRODUCT($H$48:BZ$48,$H22:BZ22)<0.5, \"Pending\", IF(BZ22<0.5, \"Complete\", \"In Progress\"))","v":"Pending"},0,0,{"$f":"IF(SUMPRODUCT($H$48:CC$48,$H22:CC22)<0.5, \"Pending\", IF(CC22<0.5, \"Complete\", \"In Progress\"))","v":"Pending"},0,0,{"$f":"IF(SUMPRODUCT($H$48:CF$48,$H22:CF22)<0.5, \"Pending\", IF(CF22<0.5, \"Complete\", \"In Progress\"))","v":"Pending"},0,0,{"$f":"IF(SUMPRODUCT($H$48:CI$48,$H22:CI22)<0.5, \"Pending\", IF(CI22<0.5, \"Complete\", \"In Progress\"))","v":"Pending"},0,0,{"$f":"IF(SUMPRODUCT($H$48:CL$48,$H22:CL22)<0.5, \"Pending\", IF(CL22<0.5, \"Complete\", \"In Progress\"))","v":"Pending"},0,0,{"$f":"IF(SUMPRODUCT($H$48:CO$48,$H22:CO22)<0.5, \"Pending\", IF(CO22<0.5, \"Complete\", \"In Progress\"))","v":"Pending"},0,0,{"$f":"IF(SUMPRODUCT($H$48:CR$48,$H22:CR22)<0.5, \"Pending\", IF(CR22<0.5, \"Complete\", \"In Progress\"))","v":"Pending"},0,0,{"$f":"IF(SUMPRODUCT($H$48:CU$48,$H22:CU22)<0.5, \"Pending\", IF(CU22<0.5, \"Complete\", \"In Progress\"))","v":"Pending"},0,0,{"$f":"IF(SUMPRODUCT($H$48:CX$48,$H22:CX22)<0.5, \"Pending\", IF(CX22<0.5, \"Complete\", \"In Progress\"))","v":"Pending"},0,0,{"$f":"IF(SUMPRODUCT($H$48:DA$48,$H22:DA22)<0.5, \"Pending\", IF(DA22<0.5, \"Complete\", \"In Progress\"))","v":"Pending"},0,0,{"$f":"IF(SUMPRODUCT($H$48:DD$48,$H22:DD22)<0.5, \"Pending\", IF(DD22<0.5, \"Complete\", \"In Progress\"))","v":"Pending"},0,0,{"$f":"IF(SUMPRODUCT($H$48:DG$48,$H22:DG22)<0.5, \"Pending\", IF(DG22<0.5, \"Complete\", \"In Progress\"))","v":"Pending"},0,0,{"$f":"IF(SUMPRODUCT($H$48:DJ$48,$H22:DJ22)<0.5, \"Pending\", IF(DJ22<0.5, \"Complete\", \"In Progress\"))","v":"Pending"},0,0,{"$f":"IF(SUMPRODUCT($H$48:DM$48,$H22:DM22)<0.5, \"Pending\", IF(DM22<0.5, \"Complete\", \"In Progress\"))","v":"Pending"},0,0,{"$f":"IF(SUMPRODUCT($H$48:DP$48,$H22:DP22)<0.5, \"Pending\", IF(DP22<0.5, \"Complete\", \"In Progress\"))","v":"Pending"},0,0,{"$f":"IF(SUMPRODUCT($H$48:DS$48,$H22:DS22)<0.5, \"Pending\", IF(DS22<0.5, \"Complete\", \"In Progress\"))","v":"Pending"},0,0,{"$f":"IF(SUMPRODUCT($H$48:DV$48,$H22:DV22)<0.5, \"Pending\", IF(DV22<0.5, \"Complete\", \"In Progress\"))","v":"Pending"},null,{"$f":"SUMPRODUCT($F$48:DE$48,$F22:DE22)","v":0}]
[null,null,null,"unassigned","Pending",1,0,0,0,{"$f":"IF(SUMPRODUCT($H$48:I$48,$H23:I23)<0.5, \"Pending\", IF(I23<0.5, \"Complete\", \"In Progress\"))","v":"Pending"},0,0,{"$f":"IF(SUMPRODUCT($H$48:L$48,$H23:L23)<0.5, \"Pending\", IF(L23<0.5, \"Complete\", \"In Progress\"))","v":"Pending"},0,0,{"$f":"IF(SUMPRODUCT($H$48:O$48,$H23:O23)<0.5, \"Pending\", IF(O23<0.5, \"Complete\", \"In Progress\"))","v":"Pending"},0,0,{"$f":"IF(SUMPRODUCT($H$48:R$48,$H23:R23)<0.5, \"Pending\", IF(R23<0.5, \"Complete\", \"In Progress\"))","v":"Pending"},0,0,{"$f":"IF(SUMPRODUCT($H$48:U$48,$H23:U23)<0.5, \"Pending\", IF(U23<0.5, \"Complete\", \"In Progress\"))","v":"Pending"},0,0,{"$f":"IF(SUMPRODUCT($H$48:X$48,$H23:X23)<0.5, \"Pending\", IF(X23<0.5, \"Complete\", \"In Progress\"))","v":"Pending"},0,0,{"$f":"IF(SUMPRODUCT($H$48:AA$48,$H23:AA23)<0.5, \"Pending\", IF(AA23<0.5, \"Complete\", \"In Progress\"))","v":"Pending"},0,0,{"$f":"IF(SUMPRODUCT($H$48:AD$48,$H23:AD23)<0.5, \"Pending\", IF(AD23<0.5, \"Complete\", \"In Progress\"))","v":"Pending"},0,0,{"$f":"IF(SUMPRODUCT($H$48:AG$48,$H23:AG23)<0.5, \"Pending\", IF(AG23<0.5, \"Complete\", \"In Progress\"))","v":"Pending"},0,0,{"$f":"IF(SUMPRODUCT($H$48:AJ$48,$H23:AJ23)<0.5, \"Pending\", IF(AJ23<0.5, \"Complete\", \"In Progress\"))","v":"Pending"},0,0,{"$f":"IF(SUMPRODUCT($H$48:AM$48,$H23:AM23)<0.5, \"Pending\", IF(AM23<0.5, \"Complete\", \"In Progress\"))","v":"Pending"},0,0,{"$f":"IF(SUMPRODUCT($H$48:AP$48,$H23:AP23)<0.5, \"Pending\", IF(AP23<0.5, \"Complete\", \"In Progress\"))","v":"Pending"},0,0,{"$f":"IF(SUMPRODUCT($H$48:AS$48,$H23:AS23)<0.5, \"Pending\", IF(AS23<0.5, \"Complete\", \"In Progress\"))","v":"Pending"},0,0,{"$f":"IF(SUMPRODUCT($H$48:AV$48,$H23:AV23)<0.5, \"Pending\", IF(AV23<0.5, \"Complete\", \"In Progress\"))","v":"Pending"},0,0,{"$f":"IF(SUMPRODUCT($H$48:AY$48,$H23:AY23)<0.5, \"Pending\", IF(AY23<0.5, \"Complete\", \"In Progress\"))","v":"Pending"},0,0,{"$f":"IF(SUMPRODUCT($H$48:BB$48,$H23:BB23)<0.5, \"Pending\", IF(BB23<0.5, \"Complete\", \"In Progress\"))","v":"Pending"},0,0,{"$f":"IF(SUMPRODUCT($H$48:BE$48,$H23:BE23)<0.5, \"Pending\", IF(BE23<0.5, \"Complete\", \"In Progress\"))","v":"Pending"},0,0,{"$f":"IF(SUMPRODUCT($H$48:BH$48,$H23:BH23)<0.5, \"Pending\", IF(BH23<0.5, \"Complete\", \"In Progress\"))","v":"Pending"},0,0,{"$f":"IF(SUMPRODUCT($H$48:BK$48,$H23:BK23)<0.5, \"Pending\", IF(BK23<0.5, \"Complete\", \"In Progress\"))","v":"Pending"},0,0,{"$f":"IF(SUMPRODUCT($H$48:BN$48,$H23:BN23)<0.5, \"Pending\", IF(BN23<0.5, \"Complete\", \"In Progress\"))","v":"Pending"},0,0,{"$f":"IF(SUMPRODUCT($H$48:BQ$48,$H23:BQ23)<0.5, \"Pending\", IF(BQ23<0.5, \"Complete\", \"In Progress\"))","v":"Pending"},0,0,{"$f":"IF(SUMPRODUCT($H$48:BT$48,$H23:BT23)<0.5, \"Pending\", IF(BT23<0.5, \"Complete\", \"In Progress\"))","v":"Pending"},0,0,{"$f":"IF(SUMPRODUCT($H$48:BW$48,$H23:BW23)<0.5, \"Pending\", IF(BW23<0.5, \"Complete\", \"In Progress\"))","v":"Pending"},0,0,{"$f":"IF(SUMPRODUCT($H$48:BZ$48,$H23:BZ23)<0.5, \"Pending\", IF(BZ23<0.5, \"Complete\", \"In Progress\"))","v":"Pending"},0,0,{"$f":"IF(SUMPRODUCT($H$48:CC$48,$H23:CC23)<0.5, \"Pending\", IF(CC23<0.5, \"Complete\", \"In Progress\"))","v":"Pending"},0,0,{"$f":"IF(SUMPRODUCT($H$48:CF$48,$H23:CF23)<0.5, \"Pending\", IF(CF23<0.5, \"Complete\", \"In Progress\"))","v":"Pending"},0,0,{"$f":"IF(SUMPRODUCT($H$48:CI$48,$H23:CI23)<0.5, \"Pending\", IF(CI23<0.5, \"Complete\", \"In Progress\"))","v":"Pending"},0,0,{"$f":"IF(SUMPRODUCT($H$48:CL$48,$H23:CL23)<0.5, \"Pending\", IF(CL23<0.5, \"Complete\", \"In Progress\"))","v":"Pending"},0,0,{"$f":"IF(SUMPRODUCT($H$48:CO$48,$H23:CO23)<0.5, \"Pending\", IF(CO23<0.5, \"Complete\", \"In Progress\"))","v":"Pending"},0,0,{"$f":"IF(SUMPRODUCT($H$48:CR$48,$H23:CR23)<0.5, \"Pending\", IF(CR23<0.5, \"Complete\", \"In Progress\"))","v":"Pending"},0,0,{"$f":"IF(SUMPRODUCT($H$48:CU$48,$H23:CU23)<0.5, \"Pending\", IF(CU23<0.5, \"Complete\", \"In Progress\"))","v":"Pending"},0,0,{"$f":"IF(SUMPRODUCT($H$48:CX$48,$H23:CX23)<0.5, \"Pending\", IF(CX23<0.5, \"Complete\", \"In Progress\"))","v":"Pending"},0,0,{"$f":"IF(SUMPRODUCT($H$48:DA$48,$H23:DA23)<0.5, \"Pending\", IF(DA23<0.5, \"Complete\", \"In Progress\"))","v":"Pending"},0,0,{"$f":"IF(SUMPRODUCT($H$48:DD$48,$H23:DD23)<0.5, \"Pending\", IF(DD23<0.5, \"Complete\", \"In Progress\"))","v":"Pending"},0,0,{"$f":"IF(SUMPRODUCT($H$48:DG$48,$H23:DG23)<0.5, \"Pending\", IF(DG23<0.5, \"Complete\", \"In Progress\"))","v":"Pending"},0,0,{"$f":"IF(SUMPRODUCT($H$48:DJ$48,$H23:DJ23)<0.5, \"Pending\", IF(DJ23<0.5, \"Complete\", \"In Progress\"))","v":"Pending"},0,0,{"$f":"IF(SUMPRODUCT($H$48:DM$48,$H23:DM23)<0.5, \"Pending\", IF(DM23<0.5, \"Complete\", \"In Progress\"))","v":"Pending"},0,0,{"$f":"IF(SUMPRODUCT($H$48:DP$48,$H23:DP23)<0.5, \"Pending\", IF(DP23<0.5, \"Complete\", \"In Progress\"))","v":"Pending"},0,0,{"$f":"IF(SUMPRODUCT($H$48:DS$48,$H23:DS23)<0.5, \"Pending\", IF(DS23<0.5, \"Complete\", \"In Progress\"))","v":"Pending"},0,0,{"$f":"IF(SUMPRODUCT($H$48:DV$48,$H23:DV23)<0.5, \"Pending\", IF(DV23<0.5, \"Complete\", \"In Progress\"))","v":"Pending"},null,{"$f":"SUMPRODUCT($F$48:DE$48,$F23:DE23)","v":0}]
[null,null,null,"unassigned","Pending",1,0,0,0,{"$f":"IF(SUMPRODUCT($H$48:I$48,$H24:I24)<0.5, \"Pending\", IF(I24<0.5, \"Complete\", \"In Progress\"))","v":"Pending"},0,0,{"$f":"IF(SUMPRODUCT($H$48:L$48,$H24:L24)<0.5, \"Pending\", IF(L24<0.5, \"Complete\", \"In Progress\"))","v":"Pending"},0,0,{"$f":"IF(SUMPRODUCT($H$48:O$48,$H24:O24)<0.5, \"Pending\", IF(O24<0.5, \"Complete\", \"In Progress\"))","v":"Pending"},0,0,{"$f":"IF(SUMPRODUCT($H$48:R$48,$H24:R24)<0.5, \"Pending\", IF(R24<0.5, \"Complete\", \"In Progress\"))","v":"Pending"},0,0,{"$f":"IF(SUMPRODUCT($H$48:U$48,$H24:U24)<0.5, \"Pending\", IF(U24<0.5, \"Complete\", \"In Progress\"))","v":"Pending"},0,0,{"$f":"IF(SUMPRODUCT($H$48:X$48,$H24:X24)<0.5, \"Pending\", IF(X24<0.5, \"Complete\", \"In Progress\"))","v":"Pending"},0,0,{"$f":"IF(SUMPRODUCT($H$48:AA$48,$H24:AA24)<0.5, \"Pending\", IF(AA24<0.5, \"Complete\", \"In Progress\"))","v":"Pending"},0,0,{"$f":"IF(SUMPRODUCT($H$48:AD$48,$H24:AD24)<0.5, \"Pending\", IF(AD24<0.5, \"Complete\", \"In Progress\"))","v":"Pending"},0,0,{"$f":"IF(SUMPRODUCT($H$48:AG$48,$H24:AG24)<0.5, \"Pending\", IF(AG24<0.5, \"Complete\", \"In Progress\"))","v":"Pending"},0,0,{"$f":"IF(SUMPRODUCT($H$48:AJ$48,$H24:AJ24)<0.5, \"Pending\", IF(AJ24<0.5, \"Complete\", \"In Progress\"))","v":"Pending"},0,0,{"$f":"IF(SUMPRODUCT($H$48:AM$48,$H24:AM24)<0.5, \"Pending\", IF(AM24<0.5, \"Complete\", \"In Progress\"))","v":"Pending"},0,0,{"$f":"IF(SUMPRODUCT($H$48:AP$48,$H24:AP24)<0.5, \"Pending\", IF(AP24<0.5, \"Complete\", \"In Progress\"))","v":"Pending"},0,0,{"$f":"IF(SUMPRODUCT($H$48:AS$48,$H24:AS24)<0.5, \"Pending\", IF(AS24<0.5, \"Complete\", \"In Progress\"))","v":"Pending"},0,0,{"$f":"IF(SUMPRODUCT($H$48:AV$48,$H24:AV24)<0.5, \"Pending\", IF(AV24<0.5, \"Complete\", \"In Progress\"))","v":"Pending"},0,0,{"$f":"IF(SUMPRODUCT($H$48:AY$48,$H24:AY24)<0.5, \"Pending\", IF(AY24<0.5, \"Complete\", \"In Progress\"))","v":"Pending"},0,0,{"$f":"IF(SUMPRODUCT($H$48:BB$48,$H24:BB24)<0.5, \"Pending\", IF(BB24<0.5, \"Complete\", \"In Progress\"))","v":"Pending"},0,0,{"$f":"IF(SUMPRODUCT($H$48:BE$48,$H24:BE24)<0.5, \"Pending\", IF(BE24<0.5, \"Complete\", \"In Progress\"))","v":"Pending"},0,0,{"$f":"IF(SUMPRODUCT($H$48:BH$48,$H24:BH24)<0.5, \"Pending\", IF(BH24<0.5, \"Complete\", \"In Progress\"))","v":"Pending"},0,0,{"$f":"IF(SUMPRODUCT($H$48:BK$48,$H24:BK24)<0.5, \"Pending\", IF(BK24<0.5, \"Complete\", \"In Progress\"))","v":"Pending"},0,0,{"$f":"IF(SUMPRODUCT($H$48:BN$48,$H24:BN24)<0.5, \"Pending\", IF(BN24<0.5, \"Complete\", \"In Progress\"))","v":"Pending"},0,0,{"$f":"IF(SUMPRODUCT($H$48:BQ$48,$H24:BQ24)<0.5, \"Pending\", IF(BQ24<0.5, \"Complete\", \"In Progress\"))","v":"Pending"},0,0,{"$f":"IF(SUMPRODUCT($H$48:BT$48,$H24:BT24)<0.5, \"Pending\", IF(BT24<0.5, \"Complete\", \"In Progress\"))","v":"Pending"},0,0,{"$f":"IF(SUMPRODUCT($H$48:BW$48,$H24:BW24)<0.5, \"Pending\", IF(BW24<0.5, \"Complete\", \"In Progress\"))","v":"Pending"},0,0,{"$f":"IF(SUMPRODUCT($H$48:BZ$48,$H24:BZ24)<0.5, \"Pending\", IF(BZ24<0.5, \"Complete\", \"In Progress\"))","v":"Pending"},0,0,{"$f":"IF(SUMPRODUCT($H$48:CC$48,$H24:CC24)<0.5, \"Pending\", IF(CC24<0.5, \"Complete\", \"In Progress\"))","v":"Pending"},0,0,{"$f":"IF(SUMPRODUCT($H$48:CF$48,$H24:CF24)<0.5, \"Pending\", IF(CF24<0.5, \"Complete\", \"In Progress\"))","v":"Pending"},0,0,{"$f":"IF(SUMPRODUCT($H$48:CI$48,$H24:CI24)<0.5, \"Pending\", IF(CI24<0.5, \"Complete\", \"In Progress\"))","v":"Pending"},0,0,{"$f":"IF(SUMPRODUCT($H$48:CL$48,$H24:CL24)<0.5, \"Pending\", IF(CL24<0.5, \"Complete\", \"In Progress\"))","v":"Pending"},0,0,{"$f":"IF(SUMPRODUCT($H$48:CO$48,$H24:CO24)<0.5, \"Pending\", IF(CO24<0.5, \"Complete\", \"In Progress\"))","v":"Pending"},0,0,{"$f":"IF(SUMPRODUCT($H$48:CR$48,$H24:CR24)<0.5, \"Pending\", IF(CR24<0.5, \"Complete\", \"In Progress\"))","v":"Pending"},0,0,{"$f":"IF(SUMPRODUCT($H$48:CU$48,$H24:CU24)<0.5, \"Pending\", IF(CU24<0.5, \"Complete\", \"In Progress\"))","v":"Pending"},0,0,{"$f":"IF(SUMPRODUCT($H$48:CX$48,$H24:CX24)<0.5, \"Pending\", IF(CX24<0.5, \"Complete\", \"In Progress\"))","v":"Pending"},0,0,{"$f":"IF(SUMPRODUCT($H$48:DA$48,$H24:DA24)<0.5, \"Pending\", IF(DA24<0.5, \"Complete\", \"In Progress\"))","v":"Pending"},0,0,{"$f":"IF(SUMPRODUCT($H$48:DD$48,$H24:DD24)<0.5, \"Pending\", IF(DD24<0.5, \"Complete\", \"In Progress\"))","v":"Pending"},0,0,{"$f":"IF(SUMPRODUCT($H$48:DG$48,$H24:DG24)<0.5, \"Pending\", IF(DG24<0.5, \"Complete\", \"In Progress\"))","v":"Pending"},0,0,{"$f":"IF(SUMPRODUCT($H$48:DJ$48,$H24:DJ24)<0.5, \"Pending\", IF(DJ24<0.5, \"Complete\", \"In Progress\"))","v":"Pending"},0,0,{"$f":"IF(SUMPRODUCT($H$48:DM$48,$H24:DM24)<0.5, \"Pending\", IF(DM24<0.5, \"Complete\", \"In Progress\"))","v":"Pending"},0,0,{"$f":"IF(SUMPRODUCT($H$48:DP$48,$H24:DP24)<0.5, \"Pending\", IF(DP24<0.5, \"Complete\", \"In Progress\"))","v":"Pending"},0,0,{"$f":"IF(SUMPRODUCT($H$48:DS$48,$H24:DS24)<0.5, \"Pending\", IF(DS24<0.5, \"Complete\", \"In Progress\"))","v":"Pending"},0,0,{"$f":"IF(SUMPRODUCT($H$48:DV$48,$H24:DV24)<0.5, \"Pending\", IF(DV24<0.5, \"Complete\", \"In Progress\"))","v":"Pending"},null,{"$f":"SUMPRODUCT($F$48:DE$48,$F24:DE24)","v":0}]
[null,null,null,"unassigned","Pending",1,0,0,0,{"$f":"IF(SUMPRODUCT($H$48:I$48,$H25:I25)<0.5, \"Pending\", IF(I25<0.5, \"Complete\", \"In Progress\"))","v":"Pending"},0,0,{"$f":"IF(SUMPRODUCT($H$48:L$48,$H25:L25)<0.5, \"Pending\", IF(L25<0.5, \"Complete\", \"In Progress\"))","v":"Pending"},0,0,{"$f":"IF(SUMPRODUCT($H$48:O$48,$H25:O25)<0.5, \"Pending\", IF(O25<0.5, \"Complete\", \"In Progress\"))","v":"Pending"},0,0,{"$f":"IF(SUMPRODUCT($H$48:R$48,$H25:R25)<0.5, \"Pending\", IF(R25<0.5, \"Complete\", \"In Progress\"))","v":"Pending"},0,0,{"$f":"IF(SUMPRODUCT($H$48:U$48,$H25:U25)<0.5, \"Pending\", IF(U25<0.5, \"Complete\", \"In Progress\"))","v":"Pending"},0,0,{"$f":"IF(SUMPRODUCT($H$48:X$48,$H25:X25)<0.5, \"Pending\", IF(X25<0.5, \"Complete\", \"In Progress\"))","v":"Pending"},0,0,{"$f":"IF(SUMPRODUCT($H$48:AA$48,$H25:AA25)<0.5, \"Pending\", IF(AA25<0.5, \"Complete\", \"In Progress\"))","v":"Pending"},0,0,{"$f":"IF(SUMPRODUCT($H$48:AD$48,$H25:AD25)<0.5, \"Pending\", IF(AD25<0.5, \"Complete\", \"In Progress\"))","v":"Pending"},0,0,{"$f":"IF(SUMPRODUCT($H$48:AG$48,$H25:AG25)<0.5, \"Pending\", IF(AG25<0.5, \"Complete\", \"In Progress\"))","v":"Pending"},0,0,{"$f":"IF(SUMPRODUCT($H$48:AJ$48,$H25:AJ25)<0.5, \"Pending\", IF(AJ25<0.5, \"Complete\", \"In Progress\"))","v":"Pending"},0,0,{"$f":"IF(SUMPRODUCT($H$48:AM$48,$H25:AM25)<0.5, \"Pending\", IF(AM25<0.5, \"Complete\", \"In Progress\"))","v":"Pending"},0,0,{"$f":"IF(SUMPRODUCT($H$48:AP$48,$H25:AP25)<0.5, \"Pending\", IF(AP25<0.5, \"Complete\", \"In Progress\"))","v":"Pending"},0,0,{"$f":"IF(SUMPRODUCT($H$48:AS$48,$H25:AS25)<0.5, \"Pending\", IF(AS25<0.5, \"Complete\", \"In Progress\"))","v":"Pending"},0,0,{"$f":"IF(SUMPRODUCT($H$48:AV$48,$H25:AV25)<0.5, \"Pending\", IF(AV25<0.5, \"Complete\", \"In Progress\"))","v":"Pending"},0,0,{"$f":"IF(SUMPRODUCT($H$48:AY$48,$H25:AY25)<0.5, \"Pending\", IF(AY25<0.5, \"Complete\", \"In Progress\"))","v":"Pending"},0,0,{"$f":"IF(SUMPRODUCT($H$48:BB$48,$H25:BB25)<0.5, \"Pending\", IF(BB25<0.5, \"Complete\", \"In Progress\"))","v":"Pending"},0,0,{"$f":"IF(SUMPRODUCT($H$48:BE$48,$H25:BE25)<0.5, \"Pending\", IF(BE25<0.5, \"Complete\", \"In Progress\"))","v":"Pending"},0,0,{"$f":"IF(SUMPRODUCT($H$48:BH$48,$H25:BH25)<0.5, \"Pending\", IF(BH25<0.5, \"Complete\", \"In Progress\"))","v":"Pending"},0,0,{"$f":"IF(SUMPRODUCT($H$48:BK$48,$H25:BK25)<0.5, \"Pending\", IF(BK25<0.5, \"Complete\", \"In Progress\"))","v":"Pending"},0,0,{"$f":"IF(SUMPRODUCT($H$48:BN$48,$H25:BN25)<0.5, \"Pending\", IF(BN25<0.5, \"Complete\", \"In Progress\"))","v":"Pending"},0,0,{"$f":"IF(SUMPRODUCT($H$48:BQ$48,$H25:BQ25)<0.5, \"Pending\", IF(BQ25<0.5, \"Complete\", \"In Progress\"))","v":"Pending"},0,0,{"$f":"IF(SUMPRODUCT($H$48:BT$48,$H25:BT25)<0.5, \"Pending\", IF(BT25<0.5, \"Complete\", \"In Progress\"))","v":"Pending"},0,0,{"$f":"IF(SUMPRODUCT($H$48:BW$48,$H25:BW25)<0.5, \"Pending\", IF(BW25<0.5, \"Complete\", \"In Progress\"))","v":"Pending"},0,0,{"$f":"IF(SUMPRODUCT($H$48:BZ$48,$H25:BZ25)<0.5, \"Pending\", IF(BZ25<0.5, \"Complete\", \"In Progress\"))","v":"Pending"},0,0,{"$f":"IF(SUMPRODUCT($H$48:CC$48,$H25:CC25)<0.5, \"Pending\", IF(CC25<0.5, \"Complete\", \"In Progress\"))","v":"Pending"},0,0,{"$f":"IF(SUMPRODUCT($H$48:CF$48,$H25:CF25)<0.5, \"Pending\", IF(CF25<0.5, \"Complete\", \"In Progress\"))","v":"Pending"},0,0,{"$f":"IF(SUMPRODUCT($H$48:CI$48,$H25:CI25)<0.5, \"Pending\", IF(CI25<0.5, \"Complete\", \"In Progress\"))","v":"Pending"},0,0,{"$f":"IF(SUMPRODUCT($H$48:CL$48,$H25:CL25)<0.5, \"Pending\", IF(CL25<0.5, \"Complete\", \"In Progress\"))","v":"Pending"},0,0,{"$f":"IF(SUMPRODUCT($H$48:CO$48,$H25:CO25)<0.5, \"Pending\", IF(CO25<0.5, \"Complete\", \"In Progress\"))","v":"Pending"},0,0,{"$f":"IF(SUMPRODUCT($H$48:CR$48,$H25:CR25)<0.5, \"Pending\", IF(CR25<0.5, \"Complete\", \"In Progress\"))","v":"Pending"},0,0,{"$f":"IF(SUMPRODUCT($H$48:CU$48,$H25:CU25)<0.5, \"Pending\", IF(CU25<0.5, \"Complete\", \"In Progress\"))","v":"Pending"},0,0,{"$f":"IF(SUMPRODUCT($H$48:CX$48,$H25:CX25)<0.5, \"Pending\", IF(CX25<0.5, \"Complete\", \"In Progress\"))","v":"Pending"},0,0,{"$f":"IF(SUMPRODUCT($H$48:DA$48,$H25:DA25)<0.5, \"Pending\", IF(DA25<0.5, \"Complete\", \"In Progress\"))","v":"Pending"},0,0,{"$f":"IF(SUMPRODUCT($H$48:DD$48,$H25:DD25)<0.5, \"Pending\", IF(DD25<0.5, \"Complete\", \"In Progress\"))","v":"Pending"},0,0,{"$f":"IF(SUMPRODUCT($H$48:DG$48,$H25:DG25)<0.5, \"Pending\", IF(DG25<0.5, \"Complete\", \"In Progress\"))","v":"Pending"},0,0,{"$f":"IF(SUMPRODUCT($H$48:DJ$48,$H25:DJ25)<0.5, \"Pending\", IF(DJ25<0.5, \"Complete\", \"In Progress\"))","v":"Pending"},0,0,{"$f":"IF(SUMPRODUCT($H$48:DM$48,$H25:DM25)<0.5, \"Pending\", IF(DM25<0.5, \"Complete\", \"In Progress\"))","v":"Pending"},0,0,{"$f":"IF(SUMPRODUCT($H$48:DP$48,$H25:DP25)<0.5, \"Pending\", IF(DP25<0.5, \"Complete\", \"In Progress\"))","v":"Pending"},0,0,{"$f":"IF(SUMPRODUCT($H$48:DS$48,$H25:DS25)<0.5, \"Pending\", IF(DS25<0.5, \"Complete\", \"In Progress\"))","v":"Pending"},0,0,{"$f":"IF(SUMPRODUCT($H$48:DV$48,$H25:DV25)<0.5, \"Pending\", IF(DV25<0.5, \"Complete\", \"In Progress\"))","v":"Pending"},null,{"$f":"SUMPRODUCT($F$48:DE$48,$F25:DE25)","v":0}]
[null,null,null,"unassigned","Pending",1,0,0,0,{"$f":"IF(SUMPRODUCT($H$48:I$48,$H26:I26)<0.5, \"Pending\", IF(I26<0.5, \"Complete\", \"In Progress\"))","v":"Pending"},0,0,{"$f":"IF(SUMPRODUCT($H$48:L$48,$H26:L26)<0.5, \"Pending\", IF(L26<0.5, \"Complete\", \"In Progress\"))","v":"Pending"},0,0,{"$f":"IF(SUMPRODUCT($H$48:O$48,$H26:O26)<0.5, \"Pending\", IF(O26<0.5, \"Complete\", \"In Progress\"))","v":"Pending"},0,0,{"$f":"IF(SUMPRODUCT($H$48:R$48,$H26:R26)<0.5, \"Pending\", IF(R26<0.5, \"Complete\", \"In Progress\"))","v":"Pending"},0,0,{"$f":"IF(SUMPRODUCT($H$48:U$48,$H26:U26)<0.5, \"Pending\", IF(U26<0.5, \"Complete\", \"In Progress\"))","v":"Pending"},0,0,{"$f":"IF(SUMPRODUCT($H$48:X$48,$H26:X26)<0.5, \"Pending\", IF(X26<0.5, \"Complete\", \"In Progress\"))","v":"Pending"},0,0,{"$f":"IF(SUMPRODUCT($H$48:AA$48,$H26:AA26)<0.5, \"Pending\", IF(AA26<0.5, \"Complete\", \"In Progress\"))","v":"Pending"},0,0,{"$f":"IF(SUMPRODUCT($H$48:AD$48,$H26:AD26)<0.5, \"Pending\", IF(AD26<0.5, \"Complete\", \"In Progress\"))","v":"Pending"},0,0,{"$f":"IF(SUMPRODUCT($H$48:AG$48,$H26:AG26)<0.5, \"Pending\", IF(AG26<0.5, \"Complete\", \"In Progress\"))","v":"Pending"},0,0,{"$f":"IF(SUMPRODUCT($H$48:AJ$48,$H26:AJ26)<0.5, \"Pending\", IF(AJ26<0.5, \"Complete\", \"In Progress\"))","v":"Pending"},0,0,{"$f":"IF(SUMPRODUCT($H$48:AM$48,$H26:AM26)<0.5, \"Pending\", IF(AM26<0.5, \"Complete\", \"In Progress\"))","v":"Pending"},0,0,{"$f":"IF(SUMPRODUCT($H$48:AP$48,$H26:AP26)<0.5, \"Pending\", IF(AP26<0.5, \"Complete\", \"In Progress\"))","v":"Pending"},0,0,{"$f":"IF(SUMPRODUCT($H$48:AS$48,$H26:AS26)<0.5, \"Pending\", IF(AS26<0.5, \"Complete\", \"In Progress\"))","v":"Pending"},0,0,{"$f":"IF(SUMPRODUCT($H$48:AV$48,$H26:AV26)<0.5, \"Pending\", IF(AV26<0.5, \"Complete\", \"In Progress\"))","v":"Pending"},0,0,{"$f":"IF(SUMPRODUCT($H$48:AY$48,$H26:AY26)<0.5, \"Pending\", IF(AY26<0.5, \"Complete\", \"In Progress\"))","v":"Pending"},0,0,{"$f":"IF(SUMPRODUCT($H$48:BB$48,$H26:BB26)<0.5, \"Pending\", IF(BB26<0.5, \"Complete\", \"In Progress\"))","v":"Pending"},0,0,{"$f":"IF(SUMPRODUCT($H$48:BE$48,$H26:BE26)<0.5, \"Pending\", IF(BE26<0.5, \"Complete\", \"In Progress\"))","v":"Pending"},0,0,{"$f":"IF(SUMPRODUCT($H$48:BH$48,$H26:BH26)<0.5, \"Pending\", IF(BH26<0.5, \"Complete\", \"In Progress\"))","v":"Pending"},0,0,{"$f":"IF(SUMPRODUCT($H$48:BK$48,$H26:BK26)<0.5, \"Pending\", IF(BK26<0.5, \"Complete\", \"In Progress\"))","v":"Pending"},0,0,{"$f":"IF(SUMPRODUCT($H$48:BN$48,$H26:BN26)<0.5, \"Pending\", IF(BN26<0.5, \"Complete\", \"In Progress\"))","v":"Pending"},0,0,{"$f":"IF(SUMPRODUCT($H$48:BQ$48,$H26:BQ26)<0.5, \"Pending\", IF(BQ26<0.5, \"Complete\", \"In Progress\"))","v":"Pending"},0,0,{"$f":"IF(SUMPRODUCT($H$48:BT$48,$H26:BT26)<0.5, \"Pending\", IF(BT26<0.5, \"Complete\", \"In Progress\"))","v":"Pending"},0,0,{"$f":"IF(SUMPRODUCT($H$48:BW$48,$H26:BW26)<0.5, \"Pending\", IF(BW26<0.5, \"Complete\", \"In Progress\"))","v":"Pending"},0,0,{"$f":"IF(SUMPRODUCT($H$48:BZ$48,$H26:BZ26)<0.5, \"Pending\", IF(BZ26<0.5, \"Complete\", \"In Progress\"))","v":"Pending"},0,0,{"$f":"IF(SUMPRODUCT($H$48:CC$48,$H26:CC26)<0.5, \"Pending\", IF(CC26<0.5, \"Complete\", \"In Progress\"))","v":"Pending"},0,0,{"$f":"IF(SUMPRODUCT($H$48:CF$48,$H26:CF26)<0.5, \"Pending\", IF(CF26<0.5, \"Complete\", \"In Progress\"))","v":"Pending"},0,0,{"$f":"IF(SUMPRODUCT($H$48:CI$48,$H26:CI26)<0.5, \"Pending\", IF(CI26<0.5, \"Complete\", \"In Progress\"))","v":"Pending"},0,0,{"$f":"IF(SUMPRODUCT($H$48:CL$48,$H26:CL26)<0.5, \"Pending\", IF(CL26<0.5, \"Complete\", \"In Progress\"))","v":"Pending"},0,0,{"$f":"IF(SUMPRODUCT($H$48:CO$48,$H26:CO26)<0.5, \"Pending\", IF(CO26<0.5, \"Complete\", \"In Progress\"))","v":"Pending"},0,0,{"$f":"IF(SUMPRODUCT($H$48:CR$48,$H26:CR26)<0.5, \"Pending\", IF(CR26<0.5, \"Complete\", \"In Progress\"))","v":"Pending"},0,0,{"$f":"IF(SUMPRODUCT($H$48:CU$48,$H26:CU26)<0.5, \"Pending\", IF(CU26<0.5, \"Complete\", \"In Progress\"))","v":"Pending"},0,0,{"$f":"IF(SUMPRODUCT($H$48:CX$48,$H26:CX26)<0.5, \"Pending\", IF(CX26<0.5, \"Complete\", \"In Progress\"))","v":"Pending"},0,0,{"$f":"IF(SUMPRODUCT($H$48:DA$48,$H26:DA26)<0.5, \"Pending\", IF(DA26<0.5, \"Complete\", \"In Progress\"))","v":"Pending"},0,0,{"$f":"IF(SUMPRODUCT($H$48:DD$48,$H26:DD26)<0.5, \"Pending\", IF(DD26<0.5, \"Complete\", \"In Progress\"))","v":"Pending"},0,0,{"$f":"IF(SUMPRODUCT($H$48:DG$48,$H26:DG26)<0.5, \"Pending\", IF(DG26<0.5, \"Complete\", \"In Progress\"))","v":"Pending"},0,0,{"$f":"IF(SUMPRODUCT($H$48:DJ$48,$H26:DJ26)<0.5, \"Pending\", IF(DJ26<0.5, \"Complete\", \"In Progress\"))","v":"Pending"},0,0,{"$f":"IF(SUMPRODUCT($H$48:DM$48,$H26:DM26)<0.5, \"Pending\", IF(DM26<0.5, \"Complete\", \"In Progress\"))","v":"Pending"},0,0,{"$f":"IF(SUMPRODUCT($H$48:DP$48,$H26:DP26)<0.5, \"Pending\", IF(DP26<0.5, \"Complete\", \"In Progress\"))","v":"Pending"},0,0,{"$f":"IF(SUMPRODUCT($H$48:DS$48,$H26:DS26)<0.5, \"Pending\", IF(DS26<0.5, \"Complete\", \"In Progress\"))","v":"Pending"},0,0,{"$f":"IF(SUMPRODUCT($H$48:DV$48,$H26:DV26)<0.5, \"Pending\", IF(DV26<0.5, \"Complete\", \"In Progress\"))","v":"Pending"},null,{"$f":"SUMPRODUCT($F$48:DE$48,$F26:DE26)","v":0}]
[null,null,null,"unassigned","Pending",1,0,0,0,{"$f":"IF(SUMPRODUCT($H$48:I$48,$H27:I27)<0.5, \"Pending\", IF(I27<0.5, \"Complete\", \"In Progress\"))","v":"Pending"},0,0,{"$f":"IF(SUMPRODUCT($H$48:L$48,$H27:L27)<0.5, \"Pending\", IF(L27<0.5, \"Complete\", \"In Progress\"))","v":"Pending"},0,0,{"$f":"IF(SUMPRODUCT($H$48:O$48,$H27:O27)<0.5, \"Pending\", IF(O27<0.5, \"Complete\", \"In Progress\"))","v":"Pending"},0,0,{"$f":"IF(SUMPRODUCT($H$48:R$48,$H27:R27)<0.5, \"Pending\", IF(R27<0.5, \"Complete\", \"In Progress\"))","v":"Pending"},0,0,{"$f":"IF(SUMPRODUCT($H$48:U$48,$H27:U27)<0.5, \"Pending\", IF(U27<0.5, \"Complete\", \"In Progress\"))","v":"Pending"},0,0,{"$f":"IF(SUMPRODUCT($H$48:X$48,$H27:X27)<0.5, \"Pending\", IF(X27<0.5, \"Complete\", \"In Progress\"))","v":"Pending"},0,0,{"$f":"IF(SUMPRODUCT($H$48:AA$48,$H27:AA27)<0.5, \"Pending\", IF(AA27<0.5, \"Complete\", \"In Progress\"))","v":"Pending"},0,0,{"$f":"IF(SUMPRODUCT($H$48:AD$48,$H27:AD27)<0.5, \"Pending\", IF(AD27<0.5, \"Complete\", \"In Progress\"))","v":"Pending"},0,0,{"$f":"IF(SUMPRODUCT($H$48:AG$48,$H27:AG27)<0.5, \"Pending\", IF(AG27<0.5, \"Complete\", \"In Progress\"))","v":"Pending"},0,0,{"$f":"IF(SUMPRODUCT($H$48:AJ$48,$H27:AJ27)<0.5, \"Pending\", IF(AJ27<0.5, \"Complete\", \"In Progress\"))","v":"Pending"},0,0,{"$f":"IF(SUMPRODUCT($H$48:AM$48,$H27:AM27)<0.5, \"Pending\", IF(AM27<0.5, \"Complete\", \"In Progress\"))","v":"Pending"},0,0,{"$f":"IF(SUMPRODUCT($H$48:AP$48,$H27:AP27)<0.5, \"Pending\", IF(AP27<0.5, \"Complete\", \"In Progress\"))","v":"Pending"},0,0,{"$f":"IF(SUMPRODUCT($H$48:AS$48,$H27:AS27)<0.5, \"Pending\", IF(AS27<0.5, \"Complete\", \"In Progress\"))","v":"Pending"},0,0,{"$f":"IF(SUMPRODUCT($H$48:AV$48,$H27:AV27)<0.5, \"Pending\", IF(AV27<0.5, \"Complete\", \"In Progress\"))","v":"Pending"},0,0,{"$f":"IF(SUMPRODUCT($H$48:AY$48,$H27:AY27)<0.5, \"Pending\", IF(AY27<0.5, \"Complete\", \"In Progress\"))","v":"Pending"},0,0,{"$f":"IF(SUMPRODUCT($H$48:BB$48,$H27:BB27)<0.5, \"Pending\", IF(BB27<0.5, \"Complete\", \"In Progress\"))","v":"Pending"},0,0,{"$f":"IF(SUMPRODUCT($H$48:BE$48,$H27:BE27)<0.5, \"Pending\", IF(BE27<0.5, \"Complete\", \"In Progress\"))","v":"Pending"},0,0,{"$f":"IF(SUMPRODUCT($H$48:BH$48,$H27:BH27)<0.5, \"Pending\", IF(BH27<0.5, \"Complete\", \"In Progress\"))","v":"Pending"},0,0,{"$f":"IF(SUMPRODUCT($H$48:BK$48,$H27:BK27)<0.5, \"Pending\", IF(BK27<0.5, \"Complete\", \"In Progress\"))","v":"Pending"},0,0,{"$f":"IF(SUMPRODUCT($H$48:BN$48,$H27:BN27)<0.5, \"Pending\", IF(BN27<0.5, \"Complete\", \"In Progress\"))","v":"Pending"},0,0,{"$f":"IF(SUMPRODUCT($H$48:BQ$48,$H27:BQ27)<0.5, \"Pending\", IF(BQ27<0.5, \"Complete\", \"In Progress\"))","v":"Pending"},0,0,{"$f":"IF(SUMPRODUCT($H$48:BT$48,$H27:BT27)<0.5, \"Pending\", IF(BT27<0.5, \"Complete\", \"In Progress\"))","v":"Pending"},0,0,{"$f":"IF(SUMPRODUCT($H$48:BW$48,$H27:BW27)<0.5, \"Pending\", IF(BW27<0.5, \"Complete\", \"In Progress\"))","v":"Pending"},0,0,{"$f":"IF(SUMPRODUCT($H$48:BZ$48,$H27:BZ27)<0.5, \"Pending\", IF(BZ27<0.5, \"Complete\", \"In Progress\"))","v":"Pending"},0,0,{"$f":"IF(SUMPRODUCT($H$48:CC$48,$H27:CC27)<0.5, \"Pending\", IF(CC27<0.5, \"Complete\", \"In Progress\"))","v":"Pending"},0,0,{"$f":"IF(SUMPRODUCT($H$48:CF$48,$H27:CF27)<0.5, \"Pending\", IF(CF27<0.5, \"Complete\", \"In Progress\"))","v":"Pending"},0,0,{"$f":"IF(SUMPRODUCT($H$48:CI$48,$H27:CI27)<0.5, \"Pending\", IF(CI27<0.5, \"Complete\", \"In Progress\"))","v":"Pending"},0,0,{"$f":"IF(SUMPRODUCT($H$48:CL$48,$H27:CL27)<0.5, \"Pending\", IF(CL27<0.5, \"Complete\", \"In Progress\"))","v":"Pending"},0,0,{"$f":"IF(SUMPRODUCT($H$48:CO$48,$H27:CO27)<0.5, \"Pending\", IF(CO27<0.5, \"Complete\", \"In Progress\"))","v":"Pending"},0,0,{"$f":"IF(SUMPRODUCT($H$48:CR$48,$H27:CR27)<0.5, \"Pending\", IF(CR27<0.5, \"Complete\", \"In Progress\"))","v":"Pending"},0,0,{"$f":"IF(SUMPRODUCT($H$48:CU$48,$H27:CU27)<0.5, \"Pending\", IF(CU27<0.5, \"Complete\", \"In Progress\"))","v":"Pending"},0,0,{"$f":"IF(SUMPRODUCT($H$48:CX$48,$H27:CX27)<0.5, \"Pending\", IF(CX27<0.5, \"Complete\", \"In Progress\"))","v":"Pending"},0,0,{"$f":"IF(SUMPRODUCT($H$48:DA$48,$H27:DA27)<0.5, \"Pending\", IF(DA27<0.5, \"Complete\", \"In Progress\"))","v":"Pending"},0,0,{"$f":"IF(SUMPRODUCT($H$48:DD$48,$H27:DD27)<0.5, \"Pending\", IF(DD27<0.5, \"Complete\", \"In Progress\"))","v":"Pending"},0,0,{"$f":"IF(SUMPRODUCT($H$48:DG$48,$H27:DG27)<0.5, \"Pending\", IF(DG27<0.5, \"Complete\", \"In Progress\"))","v":"Pending"},0,0,{"$f":"IF(SUMPRODUCT($H$48:DJ$48,$H27:DJ27)<0.5, \"Pending\", IF(DJ27<0.5, \"Complete\", \"In Progress\"))","v":"Pending"},0,0,{"$f":"IF(SUMPRODUCT($H$48:DM$48,$H27:DM27)<0.5, \"Pending\", IF(DM27<0.5, \"Complete\", \"In Progress\"))","v":"Pending"},0,0,{"$f":"IF(SUMPRODUCT($H$48:DP$48,$H27:DP27)<0.5, \"Pending\", IF(DP27<0.5, \"Complete\", \"In Progress\"))","v":"Pending"},0,0,{"$f":"IF(SUMPRODUCT($H$48:DS$48,$H27:DS27)<0.5, \"Pending\", IF(DS27<0.5, \"Complete\", \"In Progress\"))","v":"Pending"},0,0,{"$f":"IF(SUMPRODUCT($H$48:DV$48,$H27:DV27)<0.5, \"Pending\", IF(DV27<0.5, \"Complete\", \"In Progress\"))","v":"Pending"},null,{"$f":"SUMPRODUCT($F$48:DE$48,$F27:DE27)","v":0}]
[null,null,null,"unassigned","Pending",1,0,0,0,{"$f":"IF(SUMPRODUCT($H$48:I$48,$H28:I28)<0.5, \"Pending\", IF(I28<0.5, \"Complete\", \"In Progress\"))","v":"Pending"},0,0,{"$f":"IF(SUMPRODUCT($H$48:L$48,$H28:L28)<0.5, \"Pending\", IF(L28<0.5, \"Complete\", \"In Progress\"))","v":"Pending"},0,0,{"$f":"IF(SUMPRODUCT($H$48:O$48,$H28:O28)<0.5, \"Pending\", IF(O28<0.5, \"Complete\", \"In Progress\"))","v":"Pending"},0,0,{"$f":"IF(SUMPRODUCT($H$48:R$48,$H28:R28)<0.5, \"Pending\", IF(R28<0.5, \"Complete\", \"In Progress\"))","v":"Pending"},0,0,{"$f":"IF(SUMPRODUCT($H$48:U$48,$H28:U28)<0.5, \"Pending\", IF(U28<0.5, \"Complete\", \"In Progress\"))","v":"Pending"},0,0,{"$f":"IF(SUMPRODUCT($H$48:X$48,$H28:X28)<0.5, \"Pending\", IF(X28<0.5, \"Complete\", \"In Progress\"))","v":"Pending"},0,0,{"$f":"IF(SUMPRODUCT($H$48:AA$48,$H28:AA28)<0.5, \"Pending\", IF(AA28<0.5, \"Complete\", \"In Progress\"))","v":"Pending"},0,0,{"$f":"IF(SUMPRODUCT($H$48:AD$48,$H28:AD28)<0.5, \"Pending\", IF(AD28<0.5, \"Complete\", \"In Progress\"))","v":"Pending"},0,0,{"$f":"IF(SUMPRODUCT($H$48:AG$48,$H28:AG28)<0.5, \"Pending\", IF(AG28<0.5, \"Complete\", \"In Progress\"))","v":"Pending"},0,0,{"$f":"IF(SUMPRODUCT($H$48:AJ$48,$H28:AJ28)<0.5, \"Pending\", IF(AJ28<0.5, \"Complete\", \"In Progress\"))","v":"Pending"},0,0,{"$f":"IF(SUMPRODUCT($H$48:AM$48,$H28:AM28)<0.5, \"Pending\", IF(AM28<0.5, \"Complete\", \"In Progress\"))","v":"Pending"},0,0,{"$f":"IF(SUMPRODUCT($H$48:AP$48,$H28:AP28)<0.5, \"Pending\", IF(AP28<0.5, \"Complete\", \"In Progress\"))","v":"Pending"},0,0,{"$f":"IF(SUMPRODUCT($H$48:AS$48,$H28:AS28)<0.5, \"Pending\", IF(AS28<0.5, \"Complete\", \"In Progress\"))","v":"Pending"},0,0,{"$f":"IF(SUMPRODUCT($H$48:AV$48,$H28:AV28)<0.5, \"Pending\", IF(AV28<0.5, \"Complete\", \"In Progress\"))","v":"Pending"},0,0,{"$f":"IF(SUMPRODUCT($H$48:AY$48,$H28:AY28)<0.5, \"Pending\", IF(AY28<0.5, \"Complete\", \"In Progress\"))","v":"Pending"},0,0,{"$f":"IF(SUMPRODUCT($H$48:BB$48,$H28:BB28)<0.5, \"Pending\", IF(BB28<0.5, \"Complete\", \"In Progress\"))","v":"Pending"},0,0,{"$f":"IF(SUMPRODUCT($H$48:BE$48,$H28:BE28)<0.5, \"Pending\", IF(BE28<0.5, \"Complete\", \"In Progress\"))","v":"Pending"},0,0,{"$f":"IF(SUMPRODUCT($H$48:BH$48,$H28:BH28)<0.5, \"Pending\", IF(BH28<0.5, \"Complete\", \"In Progress\"))","v":"Pending"},0,0,{"$f":"IF(SUMPRODUCT($H$48:BK$48,$H28:BK28)<0.5, \"Pending\", IF(BK28<0.5, \"Complete\", \"In Progress\"))","v":"Pending"},0,0,{"$f":"IF(SUMPRODUCT($H$48:BN$48,$H28:BN28)<0.5, \"Pending\", IF(BN28<0.5, \"Complete\", \"In Progress\"))","v":"Pending"},0,0,{"$f":"IF(SUMPRODUCT($H$48:BQ$48,$H28:BQ28)<0.5, \"Pending\", IF(BQ28<0.5, \"Complete\", \"In Progress\"))","v":"Pending"},0,0,{"$f":"IF(SUMPRODUCT($H$48:BT$48,$H28:BT28)<0.5, \"Pending\", IF(BT28<0.5, \"Complete\", \"In Progress\"))","v":"Pending"},0,0,{"$f":"IF(SUMPRODUCT($H$48:BW$48,$H28:BW28)<0.5, \"Pending\", IF(BW28<0.5, \"Complete\", \"In Progress\"))","v":"Pending"},0,0,{"$f":"IF(SUMPRODUCT($H$48:BZ$48,$H28:BZ28)<0.5, \"Pending\", IF(BZ28<0.5, \"Complete\", \"In Progress\"))","v":"Pending"},0,0,{"$f":"IF(SUMPRODUCT($H$48:CC$48,$H28:CC28)<0.5, \"Pending\", IF(CC28<0.5, \"Complete\", \"In Progress\"))","v":"Pending"},0,0,{"$f":"IF(SUMPRODUCT($H$48:CF$48,$H28:CF28)<0.5, \"Pending\", IF(CF28<0.5, \"Complete\", \"In Progress\"))","v":"Pending"},0,0,{"$f":"IF(SUMPRODUCT($H$48:CI$48,$H28:CI28)<0.5, \"Pending\", IF(CI28<0.5, \"Complete\", \"In Progress\"))","v":"Pending"},0,0,{"$f":"IF(SUMPRODUCT($H$48:CL$48,$H28:CL28)<0.5, \"Pending\", IF(CL28<0.5, \"Complete\", \"In Progress\"))","v":"Pending"},0,0,{"$f":"IF(SUMPRODUCT($H$48:CO$48,$H28:CO28)<0.5, \"Pending\", IF(CO28<0.5, \"Complete\", \"In Progress\"))","v":"Pending"},0,0,{"$f":"IF(SUMPRODUCT($H$48:CR$48,$H28:CR28)<0.5, \"Pending\", IF(CR28<0.5, \"Complete\", \"In Progress\"))","v":"Pending"},0,0,{"$f":"IF(SUMPRODUCT($H$48:CU$48,$H28:CU28)<0.5, \"Pending\", IF(CU28<0.5, \"Complete\", \"In Progress\"))","v":"Pending"},0,0,{"$f":"IF(SUMPRODUCT($H$48:CX$48,$H28:CX28)<0.5, \"Pending\", IF(CX28<0.5, \"Complete\", \"In Progress\"))","v":"Pending"},0,0,{"$f":"IF(SUMPRODUCT($H$48:DA$48,$H28:DA28)<0.5, \"Pending\", IF(DA28<0.5, \"Complete\", \"In Progress\"))","v":"Pending"},0,0,{"$f":"IF(SUMPRODUCT($H$48:DD$48,$H28:DD28)<0.5, \"Pending\", IF(DD28<0.5, \"Complete\", \"In Progress\"))","v":"Pending"},0,0,{"$f":"IF(SUMPRODUCT($H$48:DG$48,$H28:DG28)<0.5, \"Pending\", IF(DG28<0.5, \"Complete\", \"In Progress\"))","v":"Pending"},0,0,{"$f":"IF(SUMPRODUCT($H$48:DJ$48,$H28:DJ28)<0.5, \"Pending\", IF(DJ28<0.5, \"Complete\", \"In Progress\"))","v":"Pending"},0,0,{"$f":"IF(SUMPRODUCT($H$48:DM$48,$H28:DM28)<0.5, \"Pending\", IF(DM28<0.5, \"Complete\", \"In Progress\"))","v":"Pending"},0,0,{"$f":"IF(SUMPRODUCT($H$48:DP$48,$H28:DP28)<0.5, \"Pending\", IF(DP28<0.5, \"Complete\", \"In Progress\"))","v":"Pending"},0,0,{"$f":"IF(SUMPRODUCT($H$48:DS$48,$H28:DS28)<0.5, \"Pending\", IF(DS28<0.5, \"Complete\", \"In Progress\"))","v":"Pending"},0,0,{"$f":"IF(SUMPRODUCT($H$48:DV$48,$H28:DV28)<0.5, \"Pending\", IF(DV28<0.5, \"Complete\", \"In Progress\"))","v":"Pending"},null,{"$f":"SUMPRODUCT($F$48:DE$48,$F28:DE28)","v":0}]
[null,null,null,"unassigned","Pending",1,0,0,0,{"$f":"IF(SUMPRODUCT($H$48:I$48,$H29:I29)<0.5, \"Pending\", IF(I29<0.5, \"Complete\", \"In Progress\"))","v":"Pending"},0,0,{"$f":"IF(SUMPRODUCT($H$48:L$48,$H29:L29)<0.5, \"Pending\", IF(L29<0.5, \"Complete\", \"In Progress\"))","v":"Pending"},0,0,{"$f":"IF(SUMPRODUCT($H$48:O$48,$H29:O29)<0.5, \"Pending\", IF(O29<0.5, \"Complete\", \"In Progress\"))","v":"Pending"},0,0,{"$f":"IF(SUMPRODUCT($H$48:R$48,$H29:R29)<0.5, \"Pending\", IF(R29<0.5, \"Complete\", \"In Progress\"))","v":"Pending"},0,0,{"$f":"IF(SUMPRODUCT($H$48:U$48,$H29:U29)<0.5, \"Pending\", IF(U29<0.5, \"Complete\", \"In Progress\"))","v":"Pending"},0,0,{"$f":"IF(SUMPRODUCT($H$48:X$48,$H29:X29)<0.5, \"Pending\", IF(X29<0.5, \"Complete\", \"In Progress\"))","v":"Pending"},0,0,{"$f":"IF(SUMPRODUCT($H$48:AA$48,$H29:AA29)<0.5, \"Pending\", IF(AA29<0.5, \"Complete\", \"In Progress\"))","v":"Pending"},0,0,{"$f":"IF(SUMPRODUCT($H$48:AD$48,$H29:AD29)<0.5, \"Pending\", IF(AD29<0.5, \"Complete\", \"In Progress\"))","v":"Pending"},0,0,{"$f":"IF(SUMPRODUCT($H$48:AG$48,$H29:AG29)<0.5, \"Pending\", IF(AG29<0.5, \"Complete\", \"In Progress\"))","v":"Pending"},0,0,{"$f":"IF(SUMPRODUCT($H$48:AJ$48,$H29:AJ29)<0.5, \"Pending\", IF(AJ29<0.5, \"Complete\", \"In Progress\"))","v":"Pending"},0,0,{"$f":"IF(SUMPRODUCT($H$48:AM$48,$H29:AM29)<0.5, \"Pending\", IF(AM29<0.5, \"Complete\", \"In Progress\"))","v":"Pending"},0,0,{"$f":"IF(SUMPRODUCT($H$48:AP$48,$H29:AP29)<0.5, \"Pending\", IF(AP29<0.5, \"Complete\", \"In Progress\"))","v":"Pending"},0,0,{"$f":"IF(SUMPRODUCT($H$48:AS$48,$H29:AS29)<0.5, \"Pending\", IF(AS29<0.5, \"Complete\", \"In Progress\"))","v":"Pending"},0,0,{"$f":"IF(SUMPRODUCT($H$48:AV$48,$H29:AV29)<0.5, \"Pending\", IF(AV29<0.5, \"Complete\", \"In Progress\"))","v":"Pending"},0,0,{"$f":"IF(SUMPRODUCT($H$48:AY$48,$H29:AY29)<0.5, \"Pending\", IF(AY29<0.5, \"Complete\", \"In Progress\"))","v":"Pending"},0,0,{"$f":"IF(SUMPRODUCT($H$48:BB$48,$H29:BB29)<0.5, \"Pending\", IF(BB29<0.5, \"Complete\", \"In Progress\"))","v":"Pending"},0,0,{"$f":"IF(SUMPRODUCT($H$48:BE$48,$H29:BE29)<0.5, \"Pending\", IF(BE29<0.5, \"Complete\", \"In Progress\"))","v":"Pending"},0,0,{"$f":"IF(SUMPRODUCT($H$48:BH$48,$H29:BH29)<0.5, \"Pending\", IF(BH29<0.5, \"Complete\", \"In Progress\"))","v":"Pending"},0,0,{"$f":"IF(SUMPRODUCT($H$48:BK$48,$H29:BK29)<0.5, \"Pending\", IF(BK29<0.5, \"Complete\", \"In Progress\"))","v":"Pending"},0,0,{"$f":"IF(SUMPRODUCT($H$48:BN$48,$H29:BN29)<0.5, \"Pending\", IF(BN29<0.5, \"Complete\", \"In Progress\"))","v":"Pending"},0,0,{"$f":"IF(SUMPRODUCT($H$48:BQ$48,$H29:BQ29)<0.5, \"Pending\", IF(BQ29<0.5, \"Complete\", \"In Progress\"))","v":"Pending"},0,0,{"$f":"IF(SUMPRODUCT($H$48:BT$48,$H29:BT29)<0.5, \"Pending\", IF(BT29<0.5, \"Complete\", \"In Progress\"))","v":"Pending"},0,0,{"$f":"IF(SUMPRODUCT($H$48:BW$48,$H29:BW29)<0.5, \"Pending\", IF(BW29<0.5, \"Complete\", \"In Progress\"))","v":"Pending"},0,0,{"$f":"IF(SUMPRODUCT($H$48:BZ$48,$H29:BZ29)<0.5, \"Pending\", IF(BZ29<0.5, \"Complete\", \"In Progress\"))","v":"Pending"},0,0,{"$f":"IF(SUMPRODUCT($H$48:CC$48,$H29:CC29)<0.5, \"Pending\", IF(CC29<0.5, \"Complete\", \"In Progress\"))","v":"Pending"},0,0,{"$f":"IF(SUMPRODUCT($H$48:CF$48,$H29:CF29)<0.5, \"Pending\", IF(CF29<0.5, \"Complete\", \"In Progress\"))","v":"Pending"},0,0,{"$f":"IF(SUMPRODUCT($H$48:CI$48,$H29:CI29)<0.5, \"Pending\", IF(CI29<0.5, \"Complete\", \"In Progress\"))","v":"Pending"},0,0,{"$f":"IF(SUMPRODUCT($H$48:CL$48,$H29:CL29)<0.5, \"Pending\", IF(CL29<0.5, \"Complete\", \"In Progress\"))","v":"Pending"},0,0,{"$f":"IF(SUMPRODUCT($H$48:CO$48,$H29:CO29)<0.5, \"Pending\", IF(CO29<0.5, \"Complete\", \"In Progress\"))","v":"Pending"},0,0,{"$f":"IF(SUMPRODUCT($H$48:CR$48,$H29:CR29)<0.5, \"Pending\", IF(CR29<0.5, \"Complete\", \"In Progress\"))","v":"Pending"},0,0,{"$f":"IF(SUMPRODUCT($H$48:CU$48,$H29:CU29)<0.5, \"Pending\", IF(CU29<0.5, \"Complete\", \"In Progress\"))","v":"Pending"},0,0,{"$f":"IF(SUMPRODUCT($H$48:CX$48,$H29:CX29)<0.5, \"Pending\", IF(CX29<0.5, \"Complete\", \"In Progress\"))","v":"Pending"},0,0,{"$f":"IF(SUMPRODUCT($H$48:DA$48,$H29:DA29)<0.5, \"Pending\", IF(DA29<0.5, \"Complete\", \"In Progress\"))","v":"Pending"},0,0,{"$f":"IF(SUMPRODUCT($H$48:DD$48,$H29:DD29)<0.5, \"Pending\", IF(DD29<0.5, \"Complete\", \"In Progress\"))","v":"Pending"},0,0,{"$f":"IF(SUMPRODUCT($H$48:DG$48,$H29:DG29)<0.5, \"Pending\", IF(DG29<0.5, \"Complete\", \"In Progress\"))","v":"Pending"},0,0,{"$f":"IF(SUMPRODUCT($H$48:DJ$48,$H29:DJ29)<0.5, \"Pending\", IF(DJ29<0.5, \"Complete\", \"In Progress\"))","v":"Pending"},0,0,{"$f":"IF(SUMPRODUCT($H$48:DM$48,$H29:DM29)<0.5, \"Pending\", IF(DM29<0.5, \"Complete\", \"In Progress\"))","v":"Pending"},0,0,{"$f":"IF(SUMPRODUCT($H$48:DP$48,$H29:DP29)<0.5, \"Pending\", IF(DP29<0.5, \"Complete\", \"In Progress\"))","v":"Pending"},0,0,{"$f":"IF(SUMPRODUCT($H$48:DS$48,$H29:DS29)<0.5, \"Pending\", IF(DS29<0.5, \"Complete\", \"In Progress\"))","v":"Pending"},0,0,{"$f":"IF(SUMPRODUCT($H$48:DV$48,$H29:DV29)<0.5, \"Pending\", IF(DV29<0.5, \"Complete\", \"In Progress\"))","v":"Pending"},null,{"$f":"SUMPRODUCT($F$48:DE$48,$F29:DE29)","v":0}]
[null,null,null,"unassigned","Pending",1,0,0,0,{"$f":"IF(SUMPRODUCT($H$48:I$48,$H30:I30)<0.5, \"Pending\", IF(I30<0.5, \"Complete\", \"In Progress\"))","v":"Pending"},0,0,{"$f":"IF(SUMPRODUCT($H$48:L$48,$H30:L30)<0.5, \"Pending\", IF(L30<0.5, \"Complete\", \"In Progress\"))","v":"Pending"},0,0,{"$f":"IF(SUMPRODUCT($H$48:O$48,$H30:O30)<0.5, \"Pending\", IF(O30<0.5, \"Complete\", \"In Progress\"))","v":"Pending"},0,0,{"$f":"IF(SUMPRODUCT($H$48:R$48,$H30:R30)<0.5, \"Pending\", IF(R30<0.5, \"Complete\", \"In Progress\"))","v":"Pending"},0,0,{"$f":"IF(SUMPRODUCT($H$48:U$48,$H30:U30)<0.5, \"Pending\", IF(U30<0.5, \"Complete\", \"In Progress\"))","v":"Pending"},0,0,{"$f":"IF(SUMPRODUCT($H$48:X$48,$H30:X30)<0.5, \"Pending\", IF(X30<0.5, \"Complete\", \"In Progress\"))","v":"Pending"},0,0,{"$f":"IF(SUMPRODUCT($H$48:AA$48,$H30:AA30)<0.5, \"Pending\", IF(AA30<0.5, \"Complete\", \"In Progress\"))","v":"Pending"},0,0,{"$f":"IF(SUMPRODUCT($H$48:AD$48,$H30:AD30)<0.5, \"Pending\", IF(AD30<0.5, \"Complete\", \"In Progress\"))","v":"Pending"},0,0,{"$f":"IF(SUMPRODUCT($H$48:AG$48,$H30:AG30)<0.5, \"Pending\", IF(AG30<0.5, \"Complete\", \"In Progress\"))","v":"Pending"},0,0,{"$f":"IF(SUMPRODUCT($H$48:AJ$48,$H30:AJ30)<0.5, \"Pending\", IF(AJ30<0.5, \"Complete\", \"In Progress\"))","v":"Pending"},0,0,{"$f":"IF(SUMPRODUCT($H$48:AM$48,$H30:AM30)<0.5, \"Pending\", IF(AM30<0.5, \"Complete\", \"In Progress\"))","v":"Pending"},0,0,{"$f":"IF(SUMPRODUCT($H$48:AP$48,$H30:AP30)<0.5, \"Pending\", IF(AP30<0.5, \"Complete\", \"In Progress\"))","v":"Pending"},0,0,{"$f":"IF(SUMPRODUCT($H$48:AS$48,$H30:AS30)<0.5, \"Pending\", IF(AS30<0.5, \"Complete\", \"In Progress\"))","v":"Pending"},0,0,{"$f":"IF(SUMPRODUCT($H$48:AV$48,$H30:AV30)<0.5, \"Pending\", IF(AV30<0.5, \"Complete\", \"In Progress\"))","v":"Pending"},0,0,{"$f":"IF(SUMPRODUCT($H$48:AY$48,$H30:AY30)<0.5, \"Pending\", IF(AY30<0.5, \"Complete\", \"In Progress\"))","v":"Pending"},0,0,{"$f":"IF(SUMPRODUCT($H$48:BB$48,$H30:BB30)<0.5, \"Pending\", IF(BB30<0.5, \"Complete\", \"In Progress\"))","v":"Pending"},0,0,{"$f":"IF(SUMPRODUCT($H$48:BE$48,$H30:BE30)<0.5, \"Pending\", IF(BE30<0.5, \"Complete\", \"In Progress\"))","v":"Pending"},0,0,{"$f":"IF(SUMPRODUCT($H$48:BH$48,$H30:BH30)<0.5, \"Pending\", IF(BH30<0.5, \"Complete\", \"In Progress\"))","v":"Pending"},0,0,{"$f":"IF(SUMPRODUCT($H$48:BK$48,$H30:BK30)<0.5, \"Pending\", IF(BK30<0.5, \"Complete\", \"In Progress\"))","v":"Pending"},0,0,{"$f":"IF(SUMPRODUCT($H$48:BN$48,$H30:BN30)<0.5, \"Pending\", IF(BN30<0.5, \"Complete\", \"In Progress\"))","v":"Pending"},0,0,{"$f":"IF(SUMPRODUCT($H$48:BQ$48,$H30:BQ30)<0.5, \"Pending\", IF(BQ30<0.5, \"Complete\", \"In Progress\"))","v":"Pending"},0,0,{"$f":"IF(SUMPRODUCT($H$48:BT$48,$H30:BT30)<0.5, \"Pending\", IF(BT30<0.5, \"Complete\", \"In Progress\"))","v":"Pending"},0,0,{"$f":"IF(SUMPRODUCT($H$48:BW$48,$H30:BW30)<0.5, \"Pending\", IF(BW30<0.5, \"Complete\", \"In Progress\"))","v":"Pending"},0,0,{"$f":"IF(SUMPRODUCT($H$48:BZ$48,$H30:BZ30)<0.5, \"Pending\", IF(BZ30<0.5, \"Complete\", \"In Progress\"))","v":"Pending"},0,0,{"$f":"IF(SUMPRODUCT($H$48:CC$48,$H30:CC30)<0.5, \"Pending\", IF(CC30<0.5, \"Complete\", \"In Progress\"))","v":"Pending"},0,0,{"$f":"IF(SUMPRODUCT($H$48:CF$48,$H30:CF30)<0.5, \"Pending\", IF(CF30<0.5, \"Complete\", \"In Progress\"))","v":"Pending"},0,0,{"$f":"IF(SUMPRODUCT($H$48:CI$48,$H30:CI30)<0.5, \"Pending\", IF(CI30<0.5, \"Complete\", \"In Progress\"))","v":"Pending"},0,0,{"$f":"IF(SUMPRODUCT($H$48:CL$48,$H30:CL30)<0.5, \"Pending\", IF(CL30<0.5, \"Complete\", \"In Progress\"))","v":"Pending"},0,0,{"$f":"IF(SUMPRODUCT($H$48:CO$48,$H30:CO30)<0.5, \"Pending\", IF(CO30<0.5, \"Complete\", \"In Progress\"))","v":"Pending"},0,0,{"$f":"IF(SUMPRODUCT($H$48:CR$48,$H30:CR30)<0.5, \"Pending\", IF(CR30<0.5, \"Complete\", \"In Progress\"))","v":"Pending"},0,0,{"$f":"IF(SUMPRODUCT($H$48:CU$48,$H30:CU30)<0.5, \"Pending\", IF(CU30<0.5, \"Complete\", \"In Progress\"))","v":"Pending"},0,0,{"$f":"IF(SUMPRODUCT($H$48:CX$48,$H30:CX30)<0.5, \"Pending\", IF(CX30<0.5, \"Complete\", \"In Progress\"))","v":"Pending"},0,0,{"$f":"IF(SUMPRODUCT($H$48:DA$48,$H30:DA30)<0.5, \"Pending\", IF(DA30<0.5, \"Complete\", \"In Progress\"))","v":"Pending"},0,0,{"$f":"IF(SUMPRODUCT($H$48:DD$48,$H30:DD30)<0.5, \"Pending\", IF(DD30<0.5, \"Complete\", \"In Progress\"))","v":"Pending"},0,0,{"$f":"IF(SUMPRODUCT($H$48:DG$48,$H30:DG30)<0.5, \"Pending\", IF(DG30<0.5, \"Complete\", \"In Progress\"))","v":"Pending"},0,0,{"$f":"IF(SUMPRODUCT($H$48:DJ$48,$H30:DJ30)<0.5, \"Pending\", IF(DJ30<0.5, \"Complete\", \"In Progress\"))","v":"Pending"},0,0,{"$f":"IF(SUMPRODUCT($H$48:DM$48,$H30:DM30)<0.5, \"Pending\", IF(DM30<0.5, \"Complete\", \"In Progress\"))","v":"Pending"},0,0,{"$f":"IF(SUMPRODUCT($H$48:DP$48,$H30:DP30)<0.5, \"Pending\", IF(DP30<0.5, \"Complete\", \"In Progress\"))","v":"Pending"},0,0,{"$f":"IF(SUMPRODUCT($H$48:DS$48,$H30:DS30)<0.5, \"Pending\", IF(DS30<0.5, \"Complete\", \"In Progress\"))","v":"Pending"},0,0,{"$f":"IF(SUMPRODUCT($H$48:DV$48,$H30:DV30)<0.5, \"Pending\", IF(DV30<0.5, \"Complete\", \"In Progress\"))","v":"Pending"},null,{"$f":"SUMPRODUCT($F$48:DE$48,$F30:DE30)","v":0}]
[null,null,null,"unassigned","Pending",1,0,0,0,{"$f":"IF(SUMPRODUCT($H$48:I$48,$H31:I31)<0.5, \"Pending\", IF(I31<0.5, \"Complete\", \"In Progress\"))","v":"Pending"},0,0,{"$f":"IF(SUMPRODUCT($H$48:L$48,$H31:L31)<0.5, \"Pending\", IF(L31<0.5, \"Complete\", \"In Progress\"))","v":"Pending"},0,0,{"$f":"IF(SUMPRODUCT($H$48:O$48,$H31:O31)<0.5, \"Pending\", IF(O31<0.5, \"Complete\", \"In Progress\"))","v":"Pending"},0,0,{"$f":"IF(SUMPRODUCT($H$48:R$48,$H31:R31)<0.5, \"Pending\", IF(R31<0.5, \"Complete\", \"In Progress\"))","v":"Pending"},0,0,{"$f":"IF(SUMPRODUCT($H$48:U$48,$H31:U31)<0.5, \"Pending\", IF(U31<0.5, \"Complete\", \"In Progress\"))","v":"Pending"},0,0,{"$f":"IF(SUMPRODUCT($H$48:X$48,$H31:X31)<0.5, \"Pending\", IF(X31<0.5, \"Complete\", \"In Progress\"))","v":"Pending"},0,0,{"$f":"IF(SUMPRODUCT($H$48:AA$48,$H31:AA31)<0.5, \"Pending\", IF(AA31<0.5, \"Complete\", \"In Progress\"))","v":"Pending"},0,0,{"$f":"IF(SUMPRODUCT($H$48:AD$48,$H31:AD31)<0.5, \"Pending\", IF(AD31<0.5, \"Complete\", \"In Progress\"))","v":"Pending"},0,0,{"$f":"IF(SUMPRODUCT($H$48:AG$48,$H31:AG31)<0.5, \"Pending\", IF(AG31<0.5, \"Complete\", \"In Progress\"))","v":"Pending"},0,0,{"$f":"IF(SUMPRODUCT($H$48:AJ$48,$H31:AJ31)<0.5, \"Pending\", IF(AJ31<0.5, \"Complete\", \"In Progress\"))","v":"Pending"},0,0,{"$f":"IF(SUMPRODUCT($H$48:AM$48,$H31:AM31)<0.5, \"Pending\", IF(AM31<0.5, \"Complete\", \"In Progress\"))","v":"Pending"},0,0,{"$f":"IF(SUMPRODUCT($H$48:AP$48,$H31:AP31)<0.5, \"Pending\", IF(AP31<0.5, \"Complete\", \"In Progress\"))","v":"Pending"},0,0,{"$f":"IF(SUMPRODUCT($H$48:AS$48,$H31:AS31)<0.5, \"Pending\", IF(AS31<0.5, \"Complete\", \"In Progress\"))","v":"Pending"},0,0,{"$f":"IF(SUMPRODUCT($H$48:AV$48,$H31:AV31)<0.5, \"Pending\", IF(AV31<0.5, \"Complete\", \"In Progress\"))","v":"Pending"},0,0,{"$f":"IF(SUMPRODUCT($H$48:AY$48,$H31:AY31)<0.5, \"Pending\", IF(AY31<0.5, \"Complete\", \"In Progress\"))","v":"Pending"},0,0,{"$f":"IF(SUMPRODUCT($H$48:BB$48,$H31:BB31)<0.5, \"Pending\", IF(BB31<0.5, \"Complete\", \"In Progress\"))","v":"Pending"},0,0,{"$f":"IF(SUMPRODUCT($H$48:BE$48,$H31:BE31)<0.5, \"Pending\", IF(BE31<0.5, \"Complete\", \"In Progress\"))","v":"Pending"},0,0,{"$f":"IF(SUMPRODUCT($H$48:BH$48,$H31:BH31)<0.5, \"Pending\", IF(BH31<0.5, \"Complete\", \"In Progress\"))","v":"Pending"},0,0,{"$f":"IF(SUMPRODUCT($H$48:BK$48,$H31:BK31)<0.5, \"Pending\", IF(BK31<0.5, \"Complete\", \"In Progress\"))","v":"Pending"},0,0,{"$f":"IF(SUMPRODUCT($H$48:BN$48,$H31:BN31)<0.5, \"Pending\", IF(BN31<0.5, \"Complete\", \"In Progress\"))","v":"Pending"},0,0,{"$f":"IF(SUMPRODUCT($H$48:BQ$48,$H31:BQ31)<0.5, \"Pending\", IF(BQ31<0.5, \"Complete\", \"In Progress\"))","v":"Pending"},0,0,{"$f":"IF(SUMPRODUCT($H$48:BT$48,$H31:BT31)<0.5, \"Pending\", IF(BT31<0.5, \"Complete\", \"In Progress\"))","v":"Pending"},0,0,{"$f":"IF(SUMPRODUCT($H$48:BW$48,$H31:BW31)<0.5, \"Pending\", IF(BW31<0.5, \"Complete\", \"In Progress\"))","v":"Pending"},0,0,{"$f":"IF(SUMPRODUCT($H$48:BZ$48,$H31:BZ31)<0.5, \"Pending\", IF(BZ31<0.5, \"Complete\", \"In Progress\"))","v":"Pending"},0,0,{"$f":"IF(SUMPRODUCT($H$48:CC$48,$H31:CC31)<0.5, \"Pending\", IF(CC31<0.5, \"Complete\", \"In Progress\"))","v":"Pending"},0,0,{"$f":"IF(SUMPRODUCT($H$48:CF$48,$H31:CF31)<0.5, \"Pending\", IF(CF31<0.5, \"Complete\", \"In Progress\"))","v":"Pending"},0,0,{"$f":"IF(SUMPRODUCT($H$48:CI$48,$H31:CI31)<0.5, \"Pending\", IF(CI31<0.5, \"Complete\", \"In Progress\"))","v":"Pending"},0,0,{"$f":"IF(SUMPRODUCT($H$48:CL$48,$H31:CL31)<0.5, \"Pending\", IF(CL31<0.5, \"Complete\", \"In Progress\"))","v":"Pending"},0,0,{"$f":"IF(SUMPRODUCT($H$48:CO$48,$H31:CO31)<0.5, \"Pending\", IF(CO31<0.5, \"Complete\", \"In Progress\"))","v":"Pending"},0,0,{"$f":"IF(SUMPRODUCT($H$48:CR$48,$H31:CR31)<0.5, \"Pending\", IF(CR31<0.5, \"Complete\", \"In Progress\"))","v":"Pending"},0,0,{"$f":"IF(SUMPRODUCT($H$48:CU$48,$H31:CU31)<0.5, \"Pending\", IF(CU31<0.5, \"Complete\", \"In Progress\"))","v":"Pending"},0,0,{"$f":"IF(SUMPRODUCT($H$48:CX$48,$H31:CX31)<0.5, \"Pending\", IF(CX31<0.5, \"Complete\", \"In Progress\"))","v":"Pending"},0,0,{"$f":"IF(SUMPRODUCT($H$48:DA$48,$H31:DA31)<0.5, \"Pending\", IF(DA31<0.5, \"Complete\", \"In Progress\"))","v":"Pending"},0,0,{"$f":"IF(SUMPRODUCT($H$48:DD$48,$H31:DD31)<0.5, \"Pending\", IF(DD31<0.5, \"Complete\", \"In Progress\"))","v":"Pending"},0,0,{"$f":"IF(SUMPRODUCT($H$48:DG$48,$H31:DG31)<0.5, \"Pending\", IF(DG31<0.5, \"Complete\", \"In Progress\"))","v":"Pending"},0,0,{"$f":"IF(SUMPRODUCT($H$48:DJ$48,$H31:DJ31)<0.5, \"Pending\", IF(DJ31<0.5, \"Complete\", \"In Progress\"))","v":"Pending"},0,0,{"$f":"IF(SUMPRODUCT($H$48:DM$48,$H31:DM31)<0.5, \"Pending\", IF(DM31<0.5, \"Complete\", \"In Progress\"))","v":"Pending"},0,0,{"$f":"IF(SUMPRODUCT($H$48:DP$48,$H31:DP31)<0.5, \"Pending\", IF(DP31<0.5, \"Complete\", \"In Progress\"))","v":"Pending"},0,0,{"$f":"IF(SUMPRODUCT($H$48:DS$48,$H31:DS31)<0.5, \"Pending\", IF(DS31<0.5, \"Complete\", \"In Progress\"))","v":"Pending"},0,0,{"$f":"IF(SUMPRODUCT($H$48:DV$48,$H31:DV31)<0.5, \"Pending\", IF(DV31<0.5, \"Complete\", \"In Progress\"))","v":"Pending"},null,{"$f":"SUMPRODUCT($F$48:DE$48,$F31:DE31)","v":0}]
[null,null,null,"unassigned","Pending",1,0,0,0,{"$f":"IF(SUMPRODUCT($H$48:I$48,$H32:I32)<0.5, \"Pending\", IF(I32<0.5, \"Complete\", \"In Progress\"))","v":"Pending"},0,0,{"$f":"IF(SUMPRODUCT($H$48:L$48,$H32:L32)<0.5, \"Pending\", IF(L32<0.5, \"Complete\", \"In Progress\"))","v":"Pending"},0,0,{"$f":"IF(SUMPRODUCT($H$48:O$48,$H32:O32)<0.5, \"Pending\", IF(O32<0.5, \"Complete\", \"In Progress\"))","v":"Pending"},0,0,{"$f":"IF(SUMPRODUCT($H$48:R$48,$H32:R32)<0.5, \"Pending\", IF(R32<0.5, \"Complete\", \"In Progress\"))","v":"Pending"},0,0,{"$f":"IF(SUMPRODUCT($H$48:U$48,$H32:U32)<0.5, \"Pending\", IF(U32<0.5, \"Complete\", \"In Progress\"))","v":"Pending"},0,0,{"$f":"IF(SUMPRODUCT($H$48:X$48,$H32:X32)<0.5, \"Pending\", IF(X32<0.5, \"Complete\", \"In Progress\"))","v":"Pending"},0,0,{"$f":"IF(SUMPRODUCT($H$48:AA$48,$H32:AA32)<0.5, \"Pending\", IF(AA32<0.5, \"Complete\", \"In Progress\"))","v":"Pending"},0,0,{"$f":"IF(SUMPRODUCT($H$48:AD$48,$H32:AD32)<0.5, \"Pending\", IF(AD32<0.5, \"Complete\", \"In Progress\"))","v":"Pending"},0,0,{"$f":"IF(SUMPRODUCT($H$48:AG$48,$H32:AG32)<0.5, \"Pending\", IF(AG32<0.5, \"Complete\", \"In Progress\"))","v":"Pending"},0,0,{"$f":"IF(SUMPRODUCT($H$48:AJ$48,$H32:AJ32)<0.5, \"Pending\", IF(AJ32<0.5, \"Complete\", \"In Progress\"))","v":"Pending"},0,0,{"$f":"IF(SUMPRODUCT($H$48:AM$48,$H32:AM32)<0.5, \"Pending\", IF(AM32<0.5, \"Complete\", \"In Progress\"))","v":"Pending"},0,0,{"$f":"IF(SUMPRODUCT($H$48:AP$48,$H32:AP32)<0.5, \"Pending\", IF(AP32<0.5, \"Complete\", \"In Progress\"))","v":"Pending"},0,0,{"$f":"IF(SUMPRODUCT($H$48:AS$48,$H32:AS32)<0.5, \"Pending\", IF(AS32<0.5, \"Complete\", \"In Progress\"))","v":"Pending"},0,0,{"$f":"IF(SUMPRODUCT($H$48:AV$48,$H32:AV32)<0.5, \"Pending\", IF(AV32<0.5, \"Complete\", \"In Progress\"))","v":"Pending"},0,0,{"$f":"IF(SUMPRODUCT($H$48:AY$48,$H32:AY32)<0.5, \"Pending\", IF(AY32<0.5, \"Complete\", \"In Progress\"))","v":"Pending"},0,0,{"$f":"IF(SUMPRODUCT($H$48:BB$48,$H32:BB32)<0.5, \"Pending\", IF(BB32<0.5, \"Complete\", \"In Progress\"))","v":"Pending"},0,0,{"$f":"IF(SUMPRODUCT($H$48:BE$48,$H32:BE32)<0.5, \"Pending\", IF(BE32<0.5, \"Complete\", \"In Progress\"))","v":"Pending"},0,0,{"$f":"IF(SUMPRODUCT($H$48:BH$48,$H32:BH32)<0.5, \"Pending\", IF(BH32<0.5, \"Complete\", \"In Progress\"))","v":"Pending"},0,0,{"$f":"IF(SUMPRODUCT($H$48:BK$48,$H32:BK32)<0.5, \"Pending\", IF(BK32<0.5, \"Complete\", \"In Progress\"))","v":"Pending"},0,0,{"$f":"IF(SUMPRODUCT($H$48:BN$48,$H32:BN32)<0.5, \"Pending\", IF(BN32<0.5, \"Complete\", \"In Progress\"))","v":"Pending"},0,0,{"$f":"IF(SUMPRODUCT($H$48:BQ$48,$H32:BQ32)<0.5, \"Pending\", IF(BQ32<0.5, \"Complete\", \"In Progress\"))","v":"Pending"},0,0,{"$f":"IF(SUMPRODUCT($H$48:BT$48,$H32:BT32)<0.5, \"Pending\", IF(BT32<0.5, \"Complete\", \"In Progress\"))","v":"Pending"},0,0,{"$f":"IF(SUMPRODUCT($H$48:BW$48,$H32:BW32)<0.5, \"Pending\", IF(BW32<0.5, \"Complete\", \"In Progress\"))","v":"Pending"},0,0,{"$f":"IF(SUMPRODUCT($H$48:BZ$48,$H32:BZ32)<0.5, \"Pending\", IF(BZ32<0.5, \"Complete\", \"In Progress\"))","v":"Pending"},0,0,{"$f":"IF(SUMPRODUCT($H$48:CC$48,$H32:CC32)<0.5, \"Pending\", IF(CC32<0.5, \"Complete\", \"In Progress\"))","v":"Pending"},0,0,{"$f":"IF(SUMPRODUCT($H$48:CF$48,$H32:CF32)<0.5, \"Pending\", IF(CF32<0.5, \"Complete\", \"In Progress\"))","v":"Pending"},0,0,{"$f":"IF(SUMPRODUCT($H$48:CI$48,$H32:CI32)<0.5, \"Pending\", IF(CI32<0.5, \"Complete\", \"In Progress\"))","v":"Pending"},0,0,{"$f":"IF(SUMPRODUCT($H$48:CL$48,$H32:CL32)<0.5, \"Pending\", IF(CL32<0.5, \"Complete\", \"In Progress\"))","v":"Pending"},0,0,{"$f":"IF(SUMPRODUCT($H$48:CO$48,$H32:CO32)<0.5, \"Pending\", IF(CO32<0.5, \"Complete\", \"In Progress\"))","v":"Pending"},0,0,{"$f":"IF(SUMPRODUCT($H$48:CR$48,$H32:CR32)<0.5, \"Pending\", IF(CR32<0.5, \"Complete\", \"In Progress\"))","v":"Pending"},0,0,{"$f":"IF(SUMPRODUCT($H$48:CU$48,$H32:CU32)<0.5, \"Pending\", IF(CU32<0.5, \"Complete\", \"In Progress\"))","v":"Pending"},0,0,{"$f":"IF(SUMPRODUCT($H$48:CX$48,$H32:CX32)<0.5, \"Pending\", IF(CX32<0.5, \"Complete\", \"In Progress\"))","v":"Pending"},0,0,{"$f":"IF(SUMPRODUCT($H$48:DA$48,$H32:DA32)<0.5, \"Pending\", IF(DA32<0.5, \"Complete\", \"In Progress\"))","v":"Pending"},0,0,{"$f":"IF(SUMPRODUCT($H$48:DD$48,$H32:DD32)<0.5, \"Pending\", IF(DD32<0.5, \"Complete\", \"In Progress\"))","v":"Pending"},0,0,{"$f":"IF(SUMPRODUCT($H$48:DG$48,$H32:DG32)<0.5, \"Pending\", IF(DG32<0.5, \"Complete\", \"In Progress\"))","v":"Pending"},0,0,{"$f":"IF(SUMPRODUCT($H$48:DJ$48,$H32:DJ32)<0.5, \"Pending\", IF(DJ32<0.5, \"Complete\", \"In Progress\"))","v":"Pending"},0,0,{"$f":"IF(SUMPRODUCT($H$48:DM$48,$H32:DM32)<0.5, \"Pending\", IF(DM32<0.5, \"Complete\", \"In Progress\"))","v":"Pending"},0,0,{"$f":"IF(SUMPRODUCT($H$48:DP$48,$H32:DP32)<0.5, \"Pending\", IF(DP32<0.5, \"Complete\", \"In Progress\"))","v":"Pending"},0,0,{"$f":"IF(SUMPRODUCT($H$48:DS$48,$H32:DS32)<0.5, \"Pending\", IF(DS32<0.5, \"Complete\", \"In Progress\"))","v":"Pending"},0,0,{"$f":"IF(SUMPRODUCT($H$48:DV$48,$H32:DV32)<0.5, \"Pending\", IF(DV32<0.5, \"Complete\", \"In Progress\"))","v":"Pending"},null,{"$f":"SUMPRODUCT($F$48:DE$48,$F32:DE32)","v":0}]
[null,null,null,"unassigned","Pending",1,0,0,0,{"$f":"IF(SUMPRODUCT($H$48:I$48,$H33:I33)<0.5, \"Pending\", IF(I33<0.5, \"Complete\", \"In Progress\"))","v":"Pending"},0,0,{"$f":"IF(SUMPRODUCT($H$48:L$48,$H33:L33)<0.5, \"Pending\", IF(L33<0.5, \"Complete\", \"In Progress\"))","v":"Pending"},0,0,{"$f":"IF(SUMPRODUCT($H$48:O$48,$H33:O33)<0.5, \"Pending\", IF(O33<0.5, \"Complete\", \"In Progress\"))","v":"Pending"},0,0,{"$f":"IF(SUMPRODUCT($H$48:R$48,$H33:R33)<0.5, \"Pending\", IF(R33<0.5, \"Complete\", \"In Progress\"))","v":"Pending"},0,0,{"$f":"IF(SUMPRODUCT($H$48:U$48,$H33:U33)<0.5, \"Pending\", IF(U33<0.5, \"Complete\", \"In Progress\"))","v":"Pending"},0,0,{"$f":"IF(SUMPRODUCT($H$48:X$48,$H33:X33)<0.5, \"Pending\", IF(X33<0.5, \"Complete\", \"In Progress\"))","v":"Pending"},0,0,{"$f":"IF(SUMPRODUCT($H$48:AA$48,$H33:AA33)<0.5, \"Pending\", IF(AA33<0.5, \"Complete\", \"In Progress\"))","v":"Pending"},0,0,{"$f":"IF(SUMPRODUCT($H$48:AD$48,$H33:AD33)<0.5, \"Pending\", IF(AD33<0.5, \"Complete\", \"In Progress\"))","v":"Pending"},0,0,{"$f":"IF(SUMPRODUCT($H$48:AG$48,$H33:AG33)<0.5, \"Pending\", IF(AG33<0.5, \"Complete\", \"In Progress\"))","v":"Pending"},0,0,{"$f":"IF(SUMPRODUCT($H$48:AJ$48,$H33:AJ33)<0.5, \"Pending\", IF(AJ33<0.5, \"Complete\", \"In Progress\"))","v":"Pending"},0,0,{"$f":"IF(SUMPRODUCT($H$48:AM$48,$H33:AM33)<0.5, \"Pending\", IF(AM33<0.5, \"Complete\", \"In Progress\"))","v":"Pending"},0,0,{"$f":"IF(SUMPRODUCT($H$48:AP$48,$H33:AP33)<0.5, \"Pending\", IF(AP33<0.5, \"Complete\", \"In Progress\"))","v":"Pending"},0,0,{"$f":"IF(SUMPRODUCT($H$48:AS$48,$H33:AS33)<0.5, \"Pending\", IF(AS33<0.5, \"Complete\", \"In Progress\"))","v":"Pending"},0,0,{"$f":"IF(SUMPRODUCT($H$48:AV$48,$H33:AV33)<0.5, \"Pending\", IF(AV33<0.5, \"Complete\", \"In Progress\"))","v":"Pending"},0,0,{"$f":"IF(SUMPRODUCT($H$48:AY$48,$H33:AY33)<0.5, \"Pending\", IF(AY33<0.5, \"Complete\", \"In Progress\"))","v":"Pending"},0,0,{"$f":"IF(SUMPRODUCT($H$48:BB$48,$H33:BB33)<0.5, \"Pending\", IF(BB33<0.5, \"Complete\", \"In Progress\"))","v":"Pending"},0,0,{"$f":"IF(SUMPRODUCT($H$48:BE$48,$H33:BE33)<0.5, \"Pending\", IF(BE33<0.5, \"Complete\", \"In Progress\"))","v":"Pending"},0,0,{"$f":"IF(SUMPRODUCT($H$48:BH$48,$H33:BH33)<0.5, \"Pending\", IF(BH33<0.5, \"Complete\", \"In Progress\"))","v":"Pending"},0,0,{"$f":"IF(SUMPRODUCT($H$48:BK$48,$H33:BK33)<0.5, \"Pending\", IF(BK33<0.5, \"Complete\", \"In Progress\"))","v":"Pending"},0,0,{"$f":"IF(SUMPRODUCT($H$48:BN$48,$H33:BN33)<0.5, \"Pending\", IF(BN33<0.5, \"Complete\", \"In Progress\"))","v":"Pending"},0,0,{"$f":"IF(SUMPRODUCT($H$48:BQ$48,$H33:BQ33)<0.5, \"Pending\", IF(BQ33<0.5, \"Complete\", \"In Progress\"))","v":"Pending"},0,0,{"$f":"IF(SUMPRODUCT($H$48:BT$48,$H33:BT33)<0.5, \"Pending\", IF(BT33<0.5, \"Complete\", \"In Progress\"))","v":"Pending"},0,0,{"$f":"IF(SUMPRODUCT($H$48:BW$48,$H33:BW33)<0.5, \"Pending\", IF(BW33<0.5, \"Complete\", \"In Progress\"))","v":"Pending"},0,0,{"$f":"IF(SUMPRODUCT($H$48:BZ$48,$H33:BZ33)<0.5, \"Pending\", IF(BZ33<0.5, \"Complete\", \"In Progress\"))","v":"Pending"},0,0,{"$f":"IF(SUMPRODUCT($H$48:CC$48,$H33:CC33)<0.5, \"Pending\", IF(CC33<0.5, \"Complete\", \"In Progress\"))","v":"Pending"},0,0,{"$f":"IF(SUMPRODUCT($H$48:CF$48,$H33:CF33)<0.5, \"Pending\", IF(CF33<0.5, \"Complete\", \"In Progress\"))","v":"Pending"},0,0,{"$f":"IF(SUMPRODUCT($H$48:CI$48,$H33:CI33)<0.5, \"Pending\", IF(CI33<0.5, \"Complete\", \"In Progress\"))","v":"Pending"},0,0,{"$f":"IF(SUMPRODUCT($H$48:CL$48,$H33:CL33)<0.5, \"Pending\", IF(CL33<0.5, \"Complete\", \"In Progress\"))","v":"Pending"},0,0,{"$f":"IF(SUMPRODUCT($H$48:CO$48,$H33:CO33)<0.5, \"Pending\", IF(CO33<0.5, \"Complete\", \"In Progress\"))","v":"Pending"},0,0,{"$f":"IF(SUMPRODUCT($H$48:CR$48,$H33:CR33)<0.5, \"Pending\", IF(CR33<0.5, \"Complete\", \"In Progress\"))","v":"Pending"},0,0,{"$f":"IF(SUMPRODUCT($H$48:CU$48,$H33:CU33)<0.5, \"Pending\", IF(CU33<0.5, \"Complete\", \"In Progress\"))","v":"Pending"},0,0,{"$f":"IF(SUMPRODUCT($H$48:CX$48,$H33:CX33)<0.5, \"Pending\", IF(CX33<0.5, \"Complete\", \"In Progress\"))","v":"Pending"},0,0,{"$f":"IF(SUMPRODUCT($H$48:DA$48,$H33:DA33)<0.5, \"Pending\", IF(DA33<0.5, \"Complete\", \"In Progress\"))","v":"Pending"},0,0,{"$f":"IF(SUMPRODUCT($H$48:DD$48,$H33:DD33)<0.5, \"Pending\", IF(DD33<0.5, \"Complete\", \"In Progress\"))","v":"Pending"},0,0,{"$f":"IF(SUMPRODUCT($H$48:DG$48,$H33:DG33)<0.5, \"Pending\", IF(DG33<0.5, \"Complete\", \"In Progress\"))","v":"Pending"},0,0,{"$f":"IF(SUMPRODUCT($H$48:DJ$48,$H33:DJ33)<0.5, \"Pending\", IF(DJ33<0.5, \"Complete\", \"In Progress\"))","v":"Pending"},0,0,{"$f":"IF(SUMPRODUCT($H$48:DM$48,$H33:DM33)<0.5, \"Pending\", IF(DM33<0.5, \"Complete\", \"In Progress\"))","v":"Pending"},0,0,{"$f":"IF(SUMPRODUCT($H$48:DP$48,$H33:DP33)<0.5, \"Pending\", IF(DP33<0.5, \"Complete\", \"In Progress\"))","v":"Pending"},0,0,{"$f":"IF(SUMPRODUCT($H$48:DS$48,$H33:DS33)<0.5, \"Pending\", IF(DS33<0.5, \"Complete\", \"In Progress\"))","v":"Pending"},0,0,{"$f":"IF(SUMPRODUCT($H$48:DV$48,$H33:DV33)<0.5, \"Pending\", IF(DV33<0.5, \"Complete\", \"In Progress\"))","v":"Pending"},null,{"$f":"SUMPRODUCT($F$48:DE$48,$F33:DE33)","v":0}]
[null,null,null,"unassigned","Pending",1,0,0,0,{"$f":"IF(SUMPRODUCT($H$48:I$48,$H34:I34)<0.5, \"Pending\", IF(I34<0.5, \"Complete\", \"In Progress\"))","v":"Pending"},0,0,{"$f":"IF(SUMPRODUCT($H$48:L$48,$H34:L34)<0.5, \"Pending\", IF(L34<0.5, \"Complete\", \"In Progress\"))","v":"Pending"},0,0,{"$f":"IF(SUMPRODUCT($H$48:O$48,$H34:O34)<0.5, \"Pending\", IF(O34<0.5, \"Complete\", \"In Progress\"))","v":"Pending"},0,0,{"$f":"IF(SUMPRODUCT($H$48:R$48,$H34:R34)<0.5, \"Pending\", IF(R34<0.5, \"Complete\", \"In Progress\"))","v":"Pending"},0,0,{"$f":"IF(SUMPRODUCT($H$48:U$48,$H34:U34)<0.5, \"Pending\", IF(U34<0.5, \"Complete\", \"In Progress\"))","v":"Pending"},0,0,{"$f":"IF(SUMPRODUCT($H$48:X$48,$H34:X34)<0.5, \"Pending\", IF(X34<0.5, \"Complete\", \"In Progress\"))","v":"Pending"},0,0,{"$f":"IF(SUMPRODUCT($H$48:AA$48,$H34:AA34)<0.5, \"Pending\", IF(AA34<0.5, \"Complete\", \"In Progress\"))","v":"Pending"},0,0,{"$f":"IF(SUMPRODUCT($H$48:AD$48,$H34:AD34)<0.5, \"Pending\", IF(AD34<0.5, \"Complete\", \"In Progress\"))","v":"Pending"},0,0,{"$f":"IF(SUMPRODUCT($H$48:AG$48,$H34:AG34)<0.5, \"Pending\", IF(AG34<0.5, \"Complete\", \"In Progress\"))","v":"Pending"},0,0,{"$f":"IF(SUMPRODUCT($H$48:AJ$48,$H34:AJ34)<0.5, \"Pending\", IF(AJ34<0.5, \"Complete\", \"In Progress\"))","v":"Pending"},0,0,{"$f":"IF(SUMPRODUCT($H$48:AM$48,$H34:AM34)<0.5, \"Pending\", IF(AM34<0.5, \"Complete\", \"In Progress\"))","v":"Pending"},0,0,{"$f":"IF(SUMPRODUCT($H$48:AP$48,$H34:AP34)<0.5, \"Pending\", IF(AP34<0.5, \"Complete\", \"In Progress\"))","v":"Pending"},0,0,{"$f":"IF(SUMPRODUCT($H$48:AS$48,$H34:AS34)<0.5, \"Pending\", IF(AS34<0.5, \"Complete\", \"In Progress\"))","v":"Pending"},0,0,{"$f":"IF(SUMPRODUCT($H$48:AV$48,$H34:AV34)<0.5, \"Pending\", IF(AV34<0.5, \"Complete\", \"In Progress\"))","v":"Pending"},0,0,{"$f":"IF(SUMPRODUCT($H$48:AY$48,$H34:AY34)<0.5, \"Pending\", IF(AY34<0.5, \"Complete\", \"In Progress\"))","v":"Pending"},0,0,{"$f":"IF(SUMPRODUCT($H$48:BB$48,$H34:BB34)<0.5, \"Pending\", IF(BB34<0.5, \"Complete\", \"In Progress\"))","v":"Pending"},0,0,{"$f":"IF(SUMPRODUCT($H$48:BE$48,$H34:BE34)<0.5, \"Pending\", IF(BE34<0.5, \"Complete\", \"In Progress\"))","v":"Pending"},0,0,{"$f":"IF(SUMPRODUCT($H$48:BH$48,$H34:BH34)<0.5, \"Pending\", IF(BH34<0.5, \"Complete\", \"In Progress\"))","v":"Pending"},0,0,{"$f":"IF(SUMPRODUCT($H$48:BK$48,$H34:BK34)<0.5, \"Pending\", IF(BK34<0.5, \"Complete\", \"In Progress\"))","v":"Pending"},0,0,{"$f":"IF(SUMPRODUCT($H$48:BN$48,$H34:BN34)<0.5, \"Pending\", IF(BN34<0.5, \"Complete\", \"In Progress\"))","v":"Pending"},0,0,{"$f":"IF(SUMPRODUCT($H$48:BQ$48,$H34:BQ34)<0.5, \"Pending\", IF(BQ34<0.5, \"Complete\", \"In Progress\"))","v":"Pending"},0,0,{"$f":"IF(SUMPRODUCT($H$48:BT$48,$H34:BT34)<0.5, \"Pending\", IF(BT34<0.5, \"Complete\", \"In Progress\"))","v":"Pending"},0,0,{"$f":"IF(SUMPRODUCT($H$48:BW$48,$H34:BW34)<0.5, \"Pending\", IF(BW34<0.5, \"Complete\", \"In Progress\"))","v":"Pending"},0,0,{"$f":"IF(SUMPRODUCT($H$48:BZ$48,$H34:BZ34)<0.5, \"Pending\", IF(BZ34<0.5, \"Complete\", \"In Progress\"))","v":"Pending"},0,0,{"$f":"IF(SUMPRODUCT($H$48:CC$48,$H34:CC34)<0.5, \"Pending\", IF(CC34<0.5, \"Complete\", \"In Progress\"))","v":"Pending"},0,0,{"$f":"IF(SUMPRODUCT($H$48:CF$48,$H34:CF34)<0.5, \"Pending\", IF(CF34<0.5, \"Complete\", \"In Progress\"))","v":"Pending"},0,0,{"$f":"IF(SUMPRODUCT($H$48:CI$48,$H34:CI34)<0.5, \"Pending\", IF(CI34<0.5, \"Complete\", \"In Progress\"))","v":"Pending"},0,0,{"$f":"IF(SUMPRODUCT($H$48:CL$48,$H34:CL34)<0.5, \"Pending\", IF(CL34<0.5, \"Complete\", \"In Progress\"))","v":"Pending"},0,0,{"$f":"IF(SUMPRODUCT($H$48:CO$48,$H34:CO34)<0.5, \"Pending\", IF(CO34<0.5, \"Complete\", \"In Progress\"))","v":"Pending"},0,0,{"$f":"IF(SUMPRODUCT($H$48:CR$48,$H34:CR34)<0.5, \"Pending\", IF(CR34<0.5, \"Complete\", \"In Progress\"))","v":"Pending"},0,0,{"$f":"IF(SUMPRODUCT($H$48:CU$48,$H34:CU34)<0.5, \"Pending\", IF(CU34<0.5, \"Complete\", \"In Progress\"))","v":"Pending"},0,0,{"$f":"IF(SUMPRODUCT($H$48:CX$48,$H34:CX34)<0.5, \"Pending\", IF(CX34<0.5, \"Complete\", \"In Progress\"))","v":"Pending"},0,0,{"$f":"IF(SUMPRODUCT($H$48:DA$48,$H34:DA34)<0.5, \"Pending\", IF(DA34<0.5, \"Complete\", \"In Progress\"))","v":"Pending"},0,0,{"$f":"IF(SUMPRODUCT($H$48:DD$48,$H34:DD34)<0.5, \"Pending\", IF(DD34<0.5, \"Complete\", \"In Progress\"))","v":"Pending"},0,0,{"$f":"IF(SUMPRODUCT($H$48:DG$48,$H34:DG34)<0.5, \"Pending\", IF(DG34<0.5, \"Complete\", \"In Progress\"))","v":"Pending"},0,0,{"$f":"IF(SUMPRODUCT($H$48:DJ$48,$H34:DJ34)<0.5, \"Pending\", IF(DJ34<0.5, \"Complete\", \"In Progress\"))","v":"Pending"},0,0,{"$f":"IF(SUMPRODUCT($H$48:DM$48,$H34:DM34)<0.5, \"Pending\", IF(DM34<0.5, \"Complete\", \"In Progress\"))","v":"Pending"},0,0,{"$f":"IF(SUMPRODUCT($H$48:DP$48,$H34:DP34)<0.5, \"Pending\", IF(DP34<0.5, \"Complete\", \"In Progress\"))","v":"Pending"},0,0,{"$f":"IF(SUMPRODUCT($H$48:DS$48,$H34:DS34)<0.5, \"Pending\", IF(DS34<0.5, \"Complete\", \"In Progress\"))","v":"Pending"},0,0,{"$f":"IF(SUMPRODUCT($H$48:DV$48,$H34:DV34)<0.5, \"Pending\", IF(DV34<0.5, \"Complete\", \"In Progress\"))","v":"Pending"},null,{"$f":"SUMPRODUCT($F$48:DE$48,$F34:DE34)","v":0}]
[null,null,null,"unassigned","Pending",1,0,0,0,{"$f":"IF(SUMPRODUCT($H$48:I$48,$H35:I35)<0.5, \"Pending\", IF(I35<0.5, \"Complete\", \"In Progress\"))","v":"Pending"},0,0,{"$f":"IF(SUMPRODUCT($H$48:L$48,$H35:L35)<0.5, \"Pending\", IF(L35<0.5, \"Complete\", \"In Progress\"))","v":"Pending"},0,0,{"$f":"IF(SUMPRODUCT($H$48:O$48,$H35:O35)<0.5, \"Pending\", IF(O35<0.5, \"Complete\", \"In Progress\"))","v":"Pending"},0,0,{"$f":"IF(SUMPRODUCT($H$48:R$48,$H35:R35)<0.5, \"Pending\", IF(R35<0.5, \"Complete\", \"In Progress\"))","v":"Pending"},0,0,{"$f":"IF(SUMPRODUCT($H$48:U$48,$H35:U35)<0.5, \"Pending\", IF(U35<0.5, \"Complete\", \"In Progress\"))","v":"Pending"},0,0,{"$f":"IF(SUMPRODUCT($H$48:X$48,$H35:X35)<0.5, \"Pending\", IF(X35<0.5, \"Complete\", \"In Progress\"))","v":"Pending"},0,0,{"$f":"IF(SUMPRODUCT($H$48:AA$48,$H35:AA35)<0.5, \"Pending\", IF(AA35<0.5, \"Complete\", \"In Progress\"))","v":"Pending"},0,0,{"$f":"IF(SUMPRODUCT($H$48:AD$48,$H35:AD35)<0.5, \"Pending\", IF(AD35<0.5, \"Complete\", \"In Progress\"))","v":"Pending"},0,0,{"$f":"IF(SUMPRODUCT($H$48:AG$48,$H35:AG35)<0.5, \"Pending\", IF(AG35<0.5, \"Complete\", \"In Progress\"))","v":"Pending"},0,0,{"$f":"IF(SUMPRODUCT($H$48:AJ$48,$H35:AJ35)<0.5, \"Pending\", IF(AJ35<0.5, \"Complete\", \"In Progress\"))","v":"Pending"},0,0,{"$f":"IF(SUMPRODUCT($H$48:AM$48,$H35:AM35)<0.5, \"Pending\", IF(AM35<0.5, \"Complete\", \"In Progress\"))","v":"Pending"},0,0,{"$f":"IF(SUMPRODUCT($H$48:AP$48,$H35:AP35)<0.5, \"Pending\", IF(AP35<0.5, \"Complete\", \"In Progress\"))","v":"Pending"},0,0,{"$f":"IF(SUMPRODUCT($H$48:AS$48,$H35:AS35)<0.5, \"Pending\", IF(AS35<0.5, \"Complete\", \"In Progress\"))","v":"Pending"},0,0,{"$f":"IF(SUMPRODUCT($H$48:AV$48,$H35:AV35)<0.5, \"Pending\", IF(AV35<0.5, \"Complete\", \"In Progress\"))","v":"Pending"},0,0,{"$f":"IF(SUMPRODUCT($H$48:AY$48,$H35:AY35)<0.5, \"Pending\", IF(AY35<0.5, \"Complete\", \"In Progress\"))","v":"Pending"},0,0,{"$f":"IF(SUMPRODUCT($H$48:BB$48,$H35:BB35)<0.5, \"Pending\", IF(BB35<0.5, \"Complete\", \"In Progress\"))","v":"Pending"},0,0,{"$f":"IF(SUMPRODUCT($H$48:BE$48,$H35:BE35)<0.5, \"Pending\", IF(BE35<0.5, \"Complete\", \"In Progress\"))","v":"Pending"},0,0,{"$f":"IF(SUMPRODUCT($H$48:BH$48,$H35:BH35)<0.5, \"Pending\", IF(BH35<0.5, \"Complete\", \"In Progress\"))","v":"Pending"},0,0,{"$f":"IF(SUMPRODUCT($H$48:BK$48,$H35:BK35)<0.5, \"Pending\", IF(BK35<0.5, \"Complete\", \"In Progress\"))","v":"Pending"},0,0,{"$f":"IF(SUMPRODUCT($H$48:BN$48,$H35:BN35)<0.5, \"Pending\", IF(BN35<0.5, \"Complete\", \"In Progress\"))","v":"Pending"},0,0,{"$f":"IF(SUMPRODUCT($H$48:BQ$48,$H35:BQ35)<0.5, \"Pending\", IF(BQ35<0.5, \"Complete\", \"In Progress\"))","v":"Pending"},0,0,{"$f":"IF(SUMPRODUCT($H$48:BT$48,$H35:BT35)<0.5, \"Pending\", IF(BT35<0.5, \"Complete\", \"In Progress\"))","v":"Pending"},0,0,{"$f":"IF(SUMPRODUCT($H$48:BW$48,$H35:BW35)<0.5, \"Pending\", IF(BW35<0.5, \"Complete\", \"In Progress\"))","v":"Pending"},0,0,{"$f":"IF(SUMPRODUCT($H$48:BZ$48,$H35:BZ35)<0.5, \"Pending\", IF(BZ35<0.5, \"Complete\", \"In Progress\"))","v":"Pending"},0,0,{"$f":"IF(SUMPRODUCT($H$48:CC$48,$H35:CC35)<0.5, \"Pending\", IF(CC35<0.5, \"Complete\", \"In Progress\"))","v":"Pending"},0,0,{"$f":"IF(SUMPRODUCT($H$48:CF$48,$H35:CF35)<0.5, \"Pending\", IF(CF35<0.5, \"Complete\", \"In Progress\"))","v":"Pending"},0,0,{"$f":"IF(SUMPRODUCT($H$48:CI$48,$H35:CI35)<0.5, \"Pending\", IF(CI35<0.5, \"Complete\", \"In Progress\"))","v":"Pending"},0,0,{"$f":"IF(SUMPRODUCT($H$48:CL$48,$H35:CL35)<0.5, \"Pending\", IF(CL35<0.5, \"Complete\", \"In Progress\"))","v":"Pending"},0,0,{"$f":"IF(SUMPRODUCT($H$48:CO$48,$H35:CO35)<0.5, \"Pending\", IF(CO35<0.5, \"Complete\", \"In Progress\"))","v":"Pending"},0,0,{"$f":"IF(SUMPRODUCT($H$48:CR$48,$H35:CR35)<0.5, \"Pending\", IF(CR35<0.5, \"Complete\", \"In Progress\"))","v":"Pending"},0,0,{"$f":"IF(SUMPRODUCT($H$48:CU$48,$H35:CU35)<0.5, \"Pending\", IF(CU35<0.5, \"Complete\", \"In Progress\"))","v":"Pending"},0,0,{"$f":"IF(SUMPRODUCT($H$48:CX$48,$H35:CX35)<0.5, \"Pending\", IF(CX35<0.5, \"Complete\", \"In Progress\"))","v":"Pending"},0,0,{"$f":"IF(SUMPRODUCT($H$48:DA$48,$H35:DA35)<0.5, \"Pending\", IF(DA35<0.5, \"Complete\", \"In Progress\"))","v":"Pending"},0,0,{"$f":"IF(SUMPRODUCT($H$48:DD$48,$H35:DD35)<0.5, \"Pending\", IF(DD35<0.5, \"Complete\", \"In Progress\"))","v":"Pending"},0,0,{"$f":"IF(SUMPRODUCT($H$48:DG$48,$H35:DG35)<0.5, \"Pending\", IF(DG35<0.5, \"Complete\", \"In Progress\"))","v":"Pending"},0,0,{"$f":"IF(SUMPRODUCT($H$48:DJ$48,$H35:DJ35)<0.5, \"Pending\", IF(DJ35<0.5, \"Complete\", \"In Progress\"))","v":"Pending"},0,0,{"$f":"IF(SUMPRODUCT($H$48:DM$48,$H35:DM35)<0.5, \"Pending\", IF(DM35<0.5, \"Complete\", \"In Progress\"))","v":"Pending"},0,0,{"$f":"IF(SUMPRODUCT($H$48:DP$48,$H35:DP35)<0.5, \"Pending\", IF(DP35<0.5, \"Complete\", \"In Progress\"))","v":"Pending"},0,0,{"$f":"IF(SUMPRODUCT($H$48:DS$48,$H35:DS35)<0.5, \"Pending\", IF(DS35<0.5, \"Complete\", \"In Progress\"))","v":"Pending"},0,0,{"$f":"IF(SUMPRODUCT($H$48:DV$48,$H35:DV35)<0.5, \"Pending\", IF(DV35<0.5, \"Complete\", \"In Progress\"))","v":"Pending"},null,{"$f":"SUMPRODUCT($F$48:DE$48,$F35:DE35)","v":0}]
[null,null,null,"unassigned","Pending",1,0,0,0,{"$f":"IF(SUMPRODUCT($H$48:I$48,$H36:I36)<0.5, \"Pending\", IF(I36<0.5, \"Complete\", \"In Progress\"))","v":"Pending"},0,0,{"$f":"IF(SUMPRODUCT($H$48:L$48,$H36:L36)<0.5, \"Pending\", IF(L36<0.5, \"Complete\", \"In Progress\"))","v":"Pending"},0,0,{"$f":"IF(SUMPRODUCT($H$48:O$48,$H36:O36)<0.5, \"Pending\", IF(O36<0.5, \"Complete\", \"In Progress\"))","v":"Pending"},0,0,{"$f":"IF(SUMPRODUCT($H$48:R$48,$H36:R36)<0.5, \"Pending\", IF(R36<0.5, \"Complete\", \"In Progress\"))","v":"Pending"},0,0,{"$f":"IF(SUMPRODUCT($H$48:U$48,$H36:U36)<0.5, \"Pending\", IF(U36<0.5, \"Complete\", \"In Progress\"))","v":"Pending"},0,0,{"$f":"IF(SUMPRODUCT($H$48:X$48,$H36:X36)<0.5, \"Pending\", IF(X36<0.5, \"Complete\", \"In Progress\"))","v":"Pending"},0,0,{"$f":"IF(SUMPRODUCT($H$48:AA$48,$H36:AA36)<0.5, \"Pending\", IF(AA36<0.5, \"Complete\", \"In Progress\"))","v":"Pending"},0,0,{"$f":"IF(SUMPRODUCT($H$48:AD$48,$H36:AD36)<0.5, \"Pending\", IF(AD36<0.5, \"Complete\", \"In Progress\"))","v":"Pending"},0,0,{"$f":"IF(SUMPRODUCT($H$48:AG$48,$H36:AG36)<0.5, \"Pending\", IF(AG36<0.5, \"Complete\", \"In Progress\"))","v":"Pending"},0,0,{"$f":"IF(SUMPRODUCT($H$48:AJ$48,$H36:AJ36)<0.5, \"Pending\", IF(AJ36<0.5, \"Complete\", \"In Progress\"))","v":"Pending"},0,0,{"$f":"IF(SUMPRODUCT($H$48:AM$48,$H36:AM36)<0.5, \"Pending\", IF(AM36<0.5, \"Complete\", \"In Progress\"))","v":"Pending"},0,0,{"$f":"IF(SUMPRODUCT($H$48:AP$48,$H36:AP36)<0.5, \"Pending\", IF(AP36<0.5, \"Complete\", \"In Progress\"))","v":"Pending"},0,0,{"$f":"IF(SUMPRODUCT($H$48:AS$48,$H36:AS36)<0.5, \"Pending\", IF(AS36<0.5, \"Complete\", \"In Progress\"))","v":"Pending"},0,0,{"$f":"IF(SUMPRODUCT($H$48:AV$48,$H36:AV36)<0.5, \"Pending\", IF(AV36<0.5, \"Complete\", \"In Progress\"))","v":"Pending"},0,0,{"$f":"IF(SUMPRODUCT($H$48:AY$48,$H36:AY36)<0.5, \"Pending\", IF(AY36<0.5, \"Complete\", \"In Progress\"))","v":"Pending"},0,0,{"$f":"IF(SUMPRODUCT($H$48:BB$48,$H36:BB36)<0.5, \"Pending\", IF(BB36<0.5, \"Complete\", \"In Progress\"))","v":"Pending"},0,0,{"$f":"IF(SUMPRODUCT($H$48:BE$48,$H36:BE36)<0.5, \"Pending\", IF(BE36<0.5, \"Complete\", \"In Progress\"))","v":"Pending"},0,0,{"$f":"IF(SUMPRODUCT($H$48:BH$48,$H36:BH36)<0.5, \"Pending\", IF(BH36<0.5, \"Complete\", \"In Progress\"))","v":"Pending"},0,0,{"$f":"IF(SUMPRODUCT($H$48:BK$48,$H36:BK36)<0.5, \"Pending\", IF(BK36<0.5, \"Complete\", \"In Progress\"))","v":"Pending"},0,0,{"$f":"IF(SUMPRODUCT($H$48:BN$48,$H36:BN36)<0.5, \"Pending\", IF(BN36<0.5, \"Complete\", \"In Progress\"))","v":"Pending"},0,0,{"$f":"IF(SUMPRODUCT($H$48:BQ$48,$H36:BQ36)<0.5, \"Pending\", IF(BQ36<0.5, \"Complete\", \"In Progress\"))","v":"Pending"},0,0,{"$f":"IF(SUMPRODUCT($H$48:BT$48,$H36:BT36)<0.5, \"Pending\", IF(BT36<0.5, \"Complete\", \"In Progress\"))","v":"Pending"},0,0,{"$f":"IF(SUMPRODUCT($H$48:BW$48,$H36:BW36)<0.5, \"Pending\", IF(BW36<0.5, \"Complete\", \"In Progress\"))","v":"Pending"},0,0,{"$f":"IF(SUMPRODUCT($H$48:BZ$48,$H36:BZ36)<0.5, \"Pending\", IF(BZ36<0.5, \"Complete\", \"In Progress\"))","v":"Pending"},0,0,{"$f":"IF(SUMPRODUCT($H$48:CC$48,$H36:CC36)<0.5, \"Pending\", IF(CC36<0.5, \"Complete\", \"In Progress\"))","v":"Pending"},0,0,{"$f":"IF(SUMPRODUCT($H$48:CF$48,$H36:CF36)<0.5, \"Pending\", IF(CF36<0.5, \"Complete\", \"In Progress\"))","v":"Pending"},0,0,{"$f":"IF(SUMPRODUCT($H$48:CI$48,$H36:CI36)<0.5, \"Pending\", IF(CI36<0.5, \"Complete\", \"In Progress\"))","v":"Pending"},0,0,{"$f":"IF(SUMPRODUCT($H$48:CL$48,$H36:CL36)<0.5, \"Pending\", IF(CL36<0.5, \"Complete\", \"In Progress\"))","v":"Pending"},0,0,{"$f":"IF(SUMPRODUCT($H$48:CO$48,$H36:CO36)<0.5, \"Pending\", IF(CO36<0.5, \"Complete\", \"In Progress\"))","v":"Pending"},0,0,{"$f":"IF(SUMPRODUCT($H$48:CR$48,$H36:CR36)<0.5, \"Pending\", IF(CR36<0.5, \"Complete\", \"In Progress\"))","v":"Pending"},0,0,{"$f":"IF(SUMPRODUCT($H$48:CU$48,$H36:CU36)<0.5, \"Pending\", IF(CU36<0.5, \"Complete\", \"In Progress\"))","v":"Pending"},0,0,{"$f":"IF(SUMPRODUCT($H$48:CX$48,$H36:CX36)<0.5, \"Pending\", IF(CX36<0.5, \"Complete\", \"In Progress\"))","v":"Pending"},0,0,{"$f":"IF(SUMPRODUCT($H$48:DA$48,$H36:DA36)<0.5, \"Pending\", IF(DA36<0.5, \"Complete\", \"In Progress\"))","v":"Pending"},0,0,{"$f":"IF(SUMPRODUCT($H$48:DD$48,$H36:DD36)<0.5, \"Pending\", IF(DD36<0.5, \"Complete\", \"In Progress\"))","v":"Pending"},0,0,{"$f":"IF(SUMPRODUCT($H$48:DG$48,$H36:DG36)<0.5, \"Pending\", IF(DG36<0.5, \"Complete\", \"In Progress\"))","v":"Pending"},0,0,{"$f":"IF(SUMPRODUCT($H$48:DJ$48,$H36:DJ36)<0.5, \"Pending\", IF(DJ36<0.5, \"Complete\", \"In Progress\"))","v":"Pending"},0,0,{"$f":"IF(SUMPRODUCT($H$48:DM$48,$H36:DM36)<0.5, \"Pending\", IF(DM36<0.5, \"Complete\", \"In Progress\"))","v":"Pending"},0,0,{"$f":"IF(SUMPRODUCT($H$48:DP$48,$H36:DP36)<0.5, \"Pending\", IF(DP36<0.5, \"Complete\", \"In Progress\"))","v":"Pending"},0,0,{"$f":"IF(SUMPRODUCT($H$48:DS$48,$H36:DS36)<0.5, \"Pending\", IF(DS36<0.5, \"Complete\", \"In Progress\"))","v":"Pending"},0,0,{"$f":"IF(SUMPRODUCT($H$48:DV$48,$H36:DV36)<0.5, \"Pending\", IF(DV36<0.5, \"Complete\", \"In Progress\"))","v":"Pending"},null,{"$f":"SUMPRODUCT($F$48:DE$48,$F36:DE36)","v":0}]
[null,null,null,"unassigned","Pending",1,0,0,0,{"$f":"IF(SUMPRODUCT($H$48:I$48,$H37:I37)<0.5, \"Pending\", IF(I37<0.5, \"Complete\", \"In Progress\"))","v":"Pending"},0,0,{"$f":"IF(SUMPRODUCT($H$48:L$48,$H37:L37)<0.5, \"Pending\", IF(L37<0.5, \"Complete\", \"In Progress\"))","v":"Pending"},0,0,{"$f":"IF(SUMPRODUCT($H$48:O$48,$H37:O37)<0.5, \"Pending\", IF(O37<0.5, \"Complete\", \"In Progress\"))","v":"Pending"},0,0,{"$f":"IF(SUMPRODUCT($H$48:R$48,$H37:R37)<0.5, \"Pending\", IF(R37<0.5, \"Complete\", \"In Progress\"))","v":"Pending"},0,0,{"$f":"IF(SUMPRODUCT($H$48:U$48,$H37:U37)<0.5, \"Pending\", IF(U37<0.5, \"Complete\", \"In Progress\"))","v":"Pending"},0,0,{"$f":"IF(SUMPRODUCT($H$48:X$48,$H37:X37)<0.5, \"Pending\", IF(X37<0.5, \"Complete\", \"In Progress\"))","v":"Pending"},0,0,{"$f":"IF(SUMPRODUCT($H$48:AA$48,$H37:AA37)<0.5, \"Pending\", IF(AA37<0.5, \"Complete\", \"In Progress\"))","v":"Pending"},0,0,{"$f":"IF(SUMPRODUCT($H$48:AD$48,$H37:AD37)<0.5, \"Pending\", IF(AD37<0.5, \"Complete\", \"In Progress\"))","v":"Pending"},0,0,{"$f":"IF(SUMPRODUCT($H$48:AG$48,$H37:AG37)<0.5, \"Pending\", IF(AG37<0.5, \"Complete\", \"In Progress\"))","v":"Pending"},0,0,{"$f":"IF(SUMPRODUCT($H$48:AJ$48,$H37:AJ37)<0.5, \"Pending\", IF(AJ37<0.5, \"Complete\", \"In Progress\"))","v":"Pending"},0,0,{"$f":"IF(SUMPRODUCT($H$48:AM$48,$H37:AM37)<0.5, \"Pending\", IF(AM37<0.5, \"Complete\", \"In Progress\"))","v":"Pending"},0,0,{"$f":"IF(SUMPRODUCT($H$48:AP$48,$H37:AP37)<0.5, \"Pending\", IF(AP37<0.5, \"Complete\", \"In Progress\"))","v":"Pending"},0,0,{"$f":"IF(SUMPRODUCT($H$48:AS$48,$H37:AS37)<0.5, \"Pending\", IF(AS37<0.5, \"Complete\", \"In Progress\"))","v":"Pending"},0,0,{"$f":"IF(SUMPRODUCT($H$48:AV$48,$H37:AV37)<0.5, \"Pending\", IF(AV37<0.5, \"Complete\", \"In Progress\"))","v":"Pending"},0,0,{"$f":"IF(SUMPRODUCT($H$48:AY$48,$H37:AY37)<0.5, \"Pending\", IF(AY37<0.5, \"Complete\", \"In Progress\"))","v":"Pending"},0,0,{"$f":"IF(SUMPRODUCT($H$48:BB$48,$H37:BB37)<0.5, \"Pending\", IF(BB37<0.5, \"Complete\", \"In Progress\"))","v":"Pending"},0,0,{"$f":"IF(SUMPRODUCT($H$48:BE$48,$H37:BE37)<0.5, \"Pending\", IF(BE37<0.5, \"Complete\", \"In Progress\"))","v":"Pending"},0,0,{"$f":"IF(SUMPRODUCT($H$48:BH$48,$H37:BH37)<0.5, \"Pending\", IF(BH37<0.5, \"Complete\", \"In Progress\"))","v":"Pending"},0,0,{"$f":"IF(SUMPRODUCT($H$48:BK$48,$H37:BK37)<0.5, \"Pending\", IF(BK37<0.5, \"Complete\", \"In Progress\"))","v":"Pending"},0,0,{"$f":"IF(SUMPRODUCT($H$48:BN$48,$H37:BN37)<0.5, \"Pending\", IF(BN37<0.5, \"Complete\", \"In Progress\"))","v":"Pending"},0,0,{"$f":"IF(SUMPRODUCT($H$48:BQ$48,$H37:BQ37)<0.5, \"Pending\", IF(BQ37<0.5, \"Complete\", \"In Progress\"))","v":"Pending"},0,0,{"$f":"IF(SUMPRODUCT($H$48:BT$48,$H37:BT37)<0.5, \"Pending\", IF(BT37<0.5, \"Complete\", \"In Progress\"))","v":"Pending"},0,0,{"$f":"IF(SUMPRODUCT($H$48:BW$48,$H37:BW37)<0.5, \"Pending\", IF(BW37<0.5, \"Complete\", \"In Progress\"))","v":"Pending"},0,0,{"$f":"IF(SUMPRODUCT($H$48:BZ$48,$H37:BZ37)<0.5, \"Pending\", IF(BZ37<0.5, \"Complete\", \"In Progress\"))","v":"Pending"},0,0,{"$f":"IF(SUMPRODUCT($H$48:CC$48,$H37:CC37)<0.5, \"Pending\", IF(CC37<0.5, \"Complete\", \"In Progress\"))","v":"Pending"},0,0,{"$f":"IF(SUMPRODUCT($H$48:CF$48,$H37:CF37)<0.5, \"Pending\", IF(CF37<0.5, \"Complete\", \"In Progress\"))","v":"Pending"},0,0,{"$f":"IF(SUMPRODUCT($H$48:CI$48,$H37:CI37)<0.5, \"Pending\", IF(CI37<0.5, \"Complete\", \"In Progress\"))","v":"Pending"},0,0,{"$f":"IF(SUMPRODUCT($H$48:CL$48,$H37:CL37)<0.5, \"Pending\", IF(CL37<0.5, \"Complete\", \"In Progress\"))","v":"Pending"},0,0,{"$f":"IF(SUMPRODUCT($H$48:CO$48,$H37:CO37)<0.5, \"Pending\", IF(CO37<0.5, \"Complete\", \"In Progress\"))","v":"Pending"},0,0,{"$f":"IF(SUMPRODUCT($H$48:CR$48,$H37:CR37)<0.5, \"Pending\", IF(CR37<0.5, \"Complete\", \"In Progress\"))","v":"Pending"},0,0,{"$f":"IF(SUMPRODUCT($H$48:CU$48,$H37:CU37)<0.5, \"Pending\", IF(CU37<0.5, \"Complete\", \"In Progress\"))","v":"Pending"},0,0,{"$f":"IF(SUMPRODUCT($H$48:CX$48,$H37:CX37)<0.5, \"Pending\", IF(CX37<0.5, \"Complete\", \"In Progress\"))","v":"Pending"},0,0,{"$f":"IF(SUMPRODUCT($H$48:DA$48,$H37:DA37)<0.5, \"Pending\", IF(DA37<0.5, \"Complete\", \"In Progress\"))","v":"Pending"},0,0,{"$f":"IF(SUMPRODUCT($H$48:DD$48,$H37:DD37)<0.5, \"Pending\", IF(DD37<0.5, \"Complete\", \"In Progress\"))","v":"Pending"},0,0,{"$f":"IF(SUMPRODUCT($H$48:DG$48,$H37:DG37)<0.5, \"Pending\", IF(DG37<0.5, \"Complete\", \"In Progress\"))","v":"Pending"},0,0,{"$f":"IF(SUMPRODUCT($H$48:DJ$48,$H37:DJ37)<0.5, \"Pending\", IF(DJ37<0.5, \"Complete\", \"In Progress\"))","v":"Pending"},0,0,{"$f":"IF(SUMPRODUCT($H$48:DM$48,$H37:DM37)<0.5, \"Pending\", IF(DM37<0.5, \"Complete\", \"In Progress\"))","v":"Pending"},0,0,{"$f":"IF(SUMPRODUCT($H$48:DP$48,$H37:DP37)<0.5, \"Pending\", IF(DP37<0.5, \"Complete\", \"In Progress\"))","v":"Pending"},0,0,{"$f":"IF(SUMPRODUCT($H$48:DS$48,$H37:DS37)<0.5, \"Pending\", IF(DS37<0.5, \"Complete\", \"In Progress\"))","v":"Pending"},0,0,{"$f":"IF(SUMPRODUCT($H$48:DV$48,$H37:DV37)<0.5, \"Pending\", IF(DV37<0.5, \"Complete\", \"In Progress\"))","v":"Pending"},null,{"$f":"SUMPRODUCT($F$48:DE$48,$F37:DE37)","v":0}]
[null,null,null,"unassigned","Pending",1,0,0,0,{"$f":"IF(SUMPRODUCT($H$48:I$48,$H38:I38)<0.5, \"Pending\", IF(I38<0.5, \"Complete\", \"In Progress\"))","v":"Pending"},0,0,{"$f":"IF(SUMPRODUCT($H$48:L$48,$H38:L38)<0.5, \"Pending\", IF(L38<0.5, \"Complete\", \"In Progress\"))","v":"Pending"},0,0,{"$f":"IF(SUMPRODUCT($H$48:O$48,$H38:O38)<0.5, \"Pending\", IF(O38<0.5, \"Complete\", \"In Progress\"))","v":"Pending"},0,0,{"$f":"IF(SUMPRODUCT($H$48:R$48,$H38:R38)<0.5, \"Pending\", IF(R38<0.5, \"Complete\", \"In Progress\"))","v":"Pending"},0,0,{"$f":"IF(SUMPRODUCT($H$48:U$48,$H38:U38)<0.5, \"Pending\", IF(U38<0.5, \"Complete\", \"In Progress\"))","v":"Pending"},0,0,{"$f":"IF(SUMPRODUCT($H$48:X$48,$H38:X38)<0.5, \"Pending\", IF(X38<0.5, \"Complete\", \"In Progress\"))","v":"Pending"},0,0,{"$f":"IF(SUMPRODUCT($H$48:AA$48,$H38:AA38)<0.5, \"Pending\", IF(AA38<0.5, \"Complete\", \"In Progress\"))","v":"Pending"},0,0,{"$f":"IF(SUMPRODUCT($H$48:AD$48,$H38:AD38)<0.5, \"Pending\", IF(AD38<0.5, \"Complete\", \"In Progress\"))","v":"Pending"},0,0,{"$f":"IF(SUMPRODUCT($H$48:AG$48,$H38:AG38)<0.5, \"Pending\", IF(AG38<0.5, \"Complete\", \"In Progress\"))","v":"Pending"},0,0,{"$f":"IF(SUMPRODUCT($H$48:AJ$48,$H38:AJ38)<0.5, \"Pending\", IF(AJ38<0.5, \"Complete\", \"In Progress\"))","v":"Pending"},0,0,{"$f":"IF(SUMPRODUCT($H$48:AM$48,$H38:AM38)<0.5, \"Pending\", IF(AM38<0.5, \"Complete\", \"In Progress\"))","v":"Pending"},0,0,{"$f":"IF(SUMPRODUCT($H$48:AP$48,$H38:AP38)<0.5, \"Pending\", IF(AP38<0.5, \"Complete\", \"In Progress\"))","v":"Pending"},0,0,{"$f":"IF(SUMPRODUCT($H$48:AS$48,$H38:AS38)<0.5, \"Pending\", IF(AS38<0.5, \"Complete\", \"In Progress\"))","v":"Pending"},0,0,{"$f":"IF(SUMPRODUCT($H$48:AV$48,$H38:AV38)<0.5, \"Pending\", IF(AV38<0.5, \"Complete\", \"In Progress\"))","v":"Pending"},0,0,{"$f":"IF(SUMPRODUCT($H$48:AY$48,$H38:AY38)<0.5, \"Pending\", IF(AY38<0.5, \"Complete\", \"In Progress\"))","v":"Pending"},0,0,{"$f":"IF(SUMPRODUCT($H$48:BB$48,$H38:BB38)<0.5, \"Pending\", IF(BB38<0.5, \"Complete\", \"In Progress\"))","v":"Pending"},0,0,{"$f":"IF(SUMPRODUCT($H$48:BE$48,$H38:BE38)<0.5, \"Pending\", IF(BE38<0.5, \"Complete\", \"In Progress\"))","v":"Pending"},0,0,{"$f":"IF(SUMPRODUCT($H$48:BH$48,$H38:BH38)<0.5, \"Pending\", IF(BH38<0.5, \"Complete\", \"In Progress\"))","v":"Pending"},0,0,{"$f":"IF(SUMPRODUCT($H$48:BK$48,$H38:BK38)<0.5, \"Pending\", IF(BK38<0.5, \"Complete\", \"In Progress\"))","v":"Pending"},0,0,{"$f":"IF(SUMPRODUCT($H$48:BN$48,$H38:BN38)<0.5, \"Pending\", IF(BN38<0.5, \"Complete\", \"In Progress\"))","v":"Pending"},0,0,{"$f":"IF(SUMPRODUCT($H$48:BQ$48,$H38:BQ38)<0.5, \"Pending\", IF(BQ38<0.5, \"Complete\", \"In Progress\"))","v":"Pending"},0,0,{"$f":"IF(SUMPRODUCT($H$48:BT$48,$H38:BT38)<0.5, \"Pending\", IF(BT38<0.5, \"Complete\", \"In Progress\"))","v":"Pending"},0,0,{"$f":"IF(SUMPRODUCT($H$48:BW$48,$H38:BW38)<0.5, \"Pending\", IF(BW38<0.5, \"Complete\", \"In Progress\"))","v":"Pending"},0,0,{"$f":"IF(SUMPRODUCT($H$48:BZ$48,$H38:BZ38)<0.5, \"Pending\", IF(BZ38<0.5, \"Complete\", \"In Progress\"))","v":"Pending"},0,0,{"$f":"IF(SUMPRODUCT($H$48:CC$48,$H38:CC38)<0.5, \"Pending\", IF(CC38<0.5, \"Complete\", \"In Progress\"))","v":"Pending"},0,0,{"$f":"IF(SUMPRODUCT($H$48:CF$48,$H38:CF38)<0.5, \"Pending\", IF(CF38<0.5, \"Complete\", \"In Progress\"))","v":"Pending"},0,0,{"$f":"IF(SUMPRODUCT($H$48:CI$48,$H38:CI38)<0.5, \"Pending\", IF(CI38<0.5, \"Complete\", \"In Progress\"))","v":"Pending"},0,0,{"$f":"IF(SUMPRODUCT($H$48:CL$48,$H38:CL38)<0.5, \"Pending\", IF(CL38<0.5, \"Complete\", \"In Progress\"))","v":"Pending"},0,0,{"$f":"IF(SUMPRODUCT($H$48:CO$48,$H38:CO38)<0.5, \"Pending\", IF(CO38<0.5, \"Complete\", \"In Progress\"))","v":"Pending"},0,0,{"$f":"IF(SUMPRODUCT($H$48:CR$48,$H38:CR38)<0.5, \"Pending\", IF(CR38<0.5, \"Complete\", \"In Progress\"))","v":"Pending"},0,0,{"$f":"IF(SUMPRODUCT($H$48:CU$48,$H38:CU38)<0.5, \"Pending\", IF(CU38<0.5, \"Complete\", \"In Progress\"))","v":"Pending"},0,0,{"$f":"IF(SUMPRODUCT($H$48:CX$48,$H38:CX38)<0.5, \"Pending\", IF(CX38<0.5, \"Complete\", \"In Progress\"))","v":"Pending"},0,0,{"$f":"IF(SUMPRODUCT($H$48:DA$48,$H38:DA38)<0.5, \"Pending\", IF(DA38<0.5, \"Complete\", \"In Progress\"))","v":"Pending"},0,0,{"$f":"IF(SUMPRODUCT($H$48:DD$48,$H38:DD38)<0.5, \"Pending\", IF(DD38<0.5, \"Complete\", \"In Progress\"))","v":"Pending"},0,0,{"$f":"IF(SUMPRODUCT($H$48:DG$48,$H38:DG38)<0.5, \"Pending\", IF(DG38<0.5, \"Complete\", \"In Progress\"))","v":"Pending"},0,0,{"$f":"IF(SUMPRODUCT($H$48:DJ$48,$H38:DJ38)<0.5, \"Pending\", IF(DJ38<0.5, \"Complete\", \"In Progress\"))","v":"Pending"},0,0,{"$f":"IF(SUMPRODUCT($H$48:DM$48,$H38:DM38)<0.5, \"Pending\", IF(DM38<0.5, \"Complete\", \"In Progress\"))","v":"Pending"},0,0,{"$f":"IF(SUMPRODUCT($H$48:DP$48,$H38:DP38)<0.5, \"Pending\", IF(DP38<0.5, \"Complete\", \"In Progress\"))","v":"Pending"},0,0,{"$f":"IF(SUMPRODUCT($H$48:DS$48,$H38:DS38)<0.5, \"Pending\", IF(DS38<0.5, \"Complete\", \"In Progress\"))","v":"Pending"},0,0,{"$f":"IF(SUMPRODUCT($H$48:DV$48,$H38:DV38)<0.5, \"Pending\", IF(DV38<0.5, \"Complete\", \"In Progress\"))","v":"Pending"},null,{"$f":"SUMPRODUCT($F$48:DE$48,$F38:DE38)","v":0}]
[null,null,null,"unassigned","Pending",1,0,0,0,{"$f":"IF(SUMPRODUCT($H$48:I$48,$H39:I39)<0.5, \"Pending\", IF(I39<0.5, \"Complete\", \"In Progress\"))","v":"Pending"},0,0,{"$f":"IF(SUMPRODUCT($H$48:L$48,$H39:L39)<0.5, \"Pending\", IF(L39<0.5, \"Complete\", \"In Progress\"))","v":"Pending"},0,0,{"$f":"IF(SUMPRODUCT($H$48:O$48,$H39:O39)<0.5, \"Pending\", IF(O39<0.5, \"Complete\", \"In Progress\"))","v":"Pending"},0,0,{"$f":"IF(SUMPRODUCT($H$48:R$48,$H39:R39)<0.5, \"Pending\", IF(R39<0.5, \"Complete\", \"In Progress\"))","v":"Pending"},0,0,{"$f":"IF(SUMPRODUCT($H$48:U$48,$H39:U39)<0.5, \"Pending\", IF(U39<0.5, \"Complete\", \"In Progress\"))","v":"Pending"},0,0,{"$f":"IF(SUMPRODUCT($H$48:X$48,$H39:X39)<0.5, \"Pending\", IF(X39<0.5, \"Complete\", \"In Progress\"))","v":"Pending"},0,0,{"$f":"IF(SUMPRODUCT($H$48:AA$48,$H39:AA39)<0.5, \"Pending\", IF(AA39<0.5, \"Complete\", \"In Progress\"))","v":"Pending"},0,0,{"$f":"IF(SUMPRODUCT($H$48:AD$48,$H39:AD39)<0.5, \"Pending\", IF(AD39<0.5, \"Complete\", \"In Progress\"))","v":"Pending"},0,0,{"$f":"IF(SUMPRODUCT($H$48:AG$48,$H39:AG39)<0.5, \"Pending\", IF(AG39<0.5, \"Complete\", \"In Progress\"))","v":"Pending"},0,0,{"$f":"IF(SUMPRODUCT($H$48:AJ$48,$H39:AJ39)<0.5, \"Pending\", IF(AJ39<0.5, \"Complete\", \"In Progress\"))","v":"Pending"},0,0,{"$f":"IF(SUMPRODUCT($H$48:AM$48,$H39:AM39)<0.5, \"Pending\", IF(AM39<0.5, \"Complete\", \"In Progress\"))","v":"Pending"},0,0,{"$f":"IF(SUMPRODUCT($H$48:AP$48,$H39:AP39)<0.5, \"Pending\", IF(AP39<0.5, \"Complete\", \"In Progress\"))","v":"Pending"},0,0,{"$f":"IF(SUMPRODUCT($H$48:AS$48,$H39:AS39)<0.5, \"Pending\", IF(AS39<0.5, \"Complete\", \"In Progress\"))","v":"Pending"},0,0,{"$f":"IF(SUMPRODUCT($H$48:AV$48,$H39:AV39)<0.5, \"Pending\", IF(AV39<0.5, \"Complete\", \"In Progress\"))","v":"Pending"},0,0,{"$f":"IF(SUMPRODUCT($H$48:AY$48,$H39:AY39)<0.5, \"Pending\", IF(AY39<0.5, \"Complete\", \"In Progress\"))","v":"Pending"},0,0,{"$f":"IF(SUMPRODUCT($H$48:BB$48,$H39:BB39)<0.5, \"Pending\", IF(BB39<0.5, \"Complete\", \"In Progress\"))","v":"Pending"},0,0,{"$f":"IF(SUMPRODUCT($H$48:BE$48,$H39:BE39)<0.5, \"Pending\", IF(BE39<0.5, \"Complete\", \"In Progress\"))","v":"Pending"},0,0,{"$f":"IF(SUMPRODUCT($H$48:BH$48,$H39:BH39)<0.5, \"Pending\", IF(BH39<0.5, \"Complete\", \"In Progress\"))","v":"Pending"},0,0,{"$f":"IF(SUMPRODUCT($H$48:BK$48,$H39:BK39)<0.5, \"Pending\", IF(BK39<0.5, \"Complete\", \"In Progress\"))","v":"Pending"},0,0,{"$f":"IF(SUMPRODUCT($H$48:BN$48,$H39:BN39)<0.5, \"Pending\", IF(BN39<0.5, \"Complete\", \"In Progress\"))","v":"Pending"},0,0,{"$f":"IF(SUMPRODUCT($H$48:BQ$48,$H39:BQ39)<0.5, \"Pending\", IF(BQ39<0.5, \"Complete\", \"In Progress\"))","v":"Pending"},0,0,{"$f":"IF(SUMPRODUCT($H$48:BT$48,$H39:BT39)<0.5, \"Pending\", IF(BT39<0.5, \"Complete\", \"In Progress\"))","v":"Pending"},0,0,{"$f":"IF(SUMPRODUCT($H$48:BW$48,$H39:BW39)<0.5, \"Pending\", IF(BW39<0.5, \"Complete\", \"In Progress\"))","v":"Pending"},0,0,{"$f":"IF(SUMPRODUCT($H$48:BZ$48,$H39:BZ39)<0.5, \"Pending\", IF(BZ39<0.5, \"Complete\", \"In Progress\"))","v":"Pending"},0,0,{"$f":"IF(SUMPRODUCT($H$48:CC$48,$H39:CC39)<0.5, \"Pending\", IF(CC39<0.5, \"Complete\", \"In Progress\"))","v":"Pending"},0,0,{"$f":"IF(SUMPRODUCT($H$48:CF$48,$H39:CF39)<0.5, \"Pending\", IF(CF39<0.5, \"Complete\", \"In Progress\"))","v":"Pending"},0,0,{"$f":"IF(SUMPRODUCT($H$48:CI$48,$H39:CI39)<0.5, \"Pending\", IF(CI39<0.5, \"Complete\", \"In Progress\"))","v":"Pending"},0,0,{"$f":"IF(SUMPRODUCT($H$48:CL$48,$H39:CL39)<0.5, \"Pending\", IF(CL39<0.5, \"Complete\", \"In Progress\"))","v":"Pending"},0,0,{"$f":"IF(SUMPRODUCT($H$48:CO$48,$H39:CO39)<0.5, \"Pending\", IF(CO39<0.5, \"Complete\", \"In Progress\"))","v":"Pending"},0,0,{"$f":"IF(SUMPRODUCT($H$48:CR$48,$H39:CR39)<0.5, \"Pending\", IF(CR39<0.5, \"Complete\", \"In Progress\"))","v":"Pending"},0,0,{"$f":"IF(SUMPRODUCT($H$48:CU$48,$H39:CU39)<0.5, \"Pending\", IF(CU39<0.5, \"Complete\", \"In Progress\"))","v":"Pending"},0,0,{"$f":"IF(SUMPRODUCT($H$48:CX$48,$H39:CX39)<0.5, \"Pending\", IF(CX39<0.5, \"Complete\", \"In Progress\"))","v":"Pending"},0,0,{"$f":"IF(SUMPRODUCT($H$48:DA$48,$H39:DA39)<0.5, \"Pending\", IF(DA39<0.5, \"Complete\", \"In Progress\"))","v":"Pending"},0,0,{"$f":"IF(SUMPRODUCT($H$48:DD$48,$H39:DD39)<0.5, \"Pending\", IF(DD39<0.5, \"Complete\", \"In Progress\"))","v":"Pending"},0,0,{"$f":"IF(SUMPRODUCT($H$48:DG$48,$H39:DG39)<0.5, \"Pending\", IF(DG39<0.5, \"Complete\", \"In Progress\"))","v":"Pending"},0,0,{"$f":"IF(SUMPRODUCT($H$48:DJ$48,$H39:DJ39)<0.5, \"Pending\", IF(DJ39<0.5, \"Complete\", \"In Progress\"))","v":"Pending"},0,0,{"$f":"IF(SUMPRODUCT($H$48:DM$48,$H39:DM39)<0.5, \"Pending\", IF(DM39<0.5, \"Complete\", \"In Progress\"))","v":"Pending"},0,0,{"$f":"IF(SUMPRODUCT($H$48:DP$48,$H39:DP39)<0.5, \"Pending\", IF(DP39<0.5, \"Complete\", \"In Progress\"))","v":"Pending"},0,0,{"$f":"IF(SUMPRODUCT($H$48:DS$48,$H39:DS39)<0.5, \"Pending\", IF(DS39<0.5, \"Complete\", \"In Progress\"))","v":"Pending"},0,0,{"$f":"IF(SUMPRODUCT($H$48:DV$48,$H39:DV39)<0.5, \"Pending\", IF(DV39<0.5, \"Complete\", \"In Progress\"))","v":"Pending"},null,{"$f":"SUMPRODUCT($F$48:DE$48,$F39:DE39)","v":0}]
[null,null,null,"unassigned","Pending",1,0,0,0,{"$f":"IF(SUMPRODUCT($H$48:I$48,$H40:I40)<0.5, \"Pending\", IF(I40<0.5, \"Complete\", \"In Progress\"))","v":"Pending"},0,0,{"$f":"IF(SUMPRODUCT($H$48:L$48,$H40:L40)<0.5, \"Pending\", IF(L40<0.5, \"Complete\", \"In Progress\"))","v":"Pending"},0,0,{"$f":"IF(SUMPRODUCT($H$48:O$48,$H40:O40)<0.5, \"Pending\", IF(O40<0.5, \"Complete\", \"In Progress\"))","v":"Pending"},0,0,{"$f":"IF(SUMPRODUCT($H$48:R$48,$H40:R40)<0.5, \"Pending\", IF(R40<0.5, \"Complete\", \"In Progress\"))","v":"Pending"},0,0,{"$f":"IF(SUMPRODUCT($H$48:U$48,$H40:U40)<0.5, \"Pending\", IF(U40<0.5, \"Complete\", \"In Progress\"))","v":"Pending"},0,0,{"$f":"IF(SUMPRODUCT($H$48:X$48,$H40:X40)<0.5, \"Pending\", IF(X40<0.5, \"Complete\", \"In Progress\"))","v":"Pending"},0,0,{"$f":"IF(SUMPRODUCT($H$48:AA$48,$H40:AA40)<0.5, \"Pending\", IF(AA40<0.5, \"Complete\", \"In Progress\"))","v":"Pending"},0,0,{"$f":"IF(SUMPRODUCT($H$48:AD$48,$H40:AD40)<0.5, \"Pending\", IF(AD40<0.5, \"Complete\", \"In Progress\"))","v":"Pending"},0,0,{"$f":"IF(SUMPRODUCT($H$48:AG$48,$H40:AG40)<0.5, \"Pending\", IF(AG40<0.5, \"Complete\", \"In Progress\"))","v":"Pending"},0,0,{"$f":"IF(SUMPRODUCT($H$48:AJ$48,$H40:AJ40)<0.5, \"Pending\", IF(AJ40<0.5, \"Complete\", \"In Progress\"))","v":"Pending"},0,0,{"$f":"IF(SUMPRODUCT($H$48:AM$48,$H40:AM40)<0.5, \"Pending\", IF(AM40<0.5, \"Complete\", \"In Progress\"))","v":"Pending"},0,0,{"$f":"IF(SUMPRODUCT($H$48:AP$48,$H40:AP40)<0.5, \"Pending\", IF(AP40<0.5, \"Complete\", \"In Progress\"))","v":"Pending"},0,0,{"$f":"IF(SUMPRODUCT($H$48:AS$48,$H40:AS40)<0.5, \"Pending\", IF(AS40<0.5, \"Complete\", \"In Progress\"))","v":"Pending"},0,0,{"$f":"IF(SUMPRODUCT($H$48:AV$48,$H40:AV40)<0.5, \"Pending\", IF(AV40<0.5, \"Complete\", \"In Progress\"))","v":"Pending"},0,0,{"$f":"IF(SUMPRODUCT($H$48:AY$48,$H40:AY40)<0.5, \"Pending\", IF(AY40<0.5, \"Complete\", \"In Progress\"))","v":"Pending"},0,0,{"$f":"IF(SUMPRODUCT($H$48:BB$48,$H40:BB40)<0.5, \"Pending\", IF(BB40<0.5, \"Complete\", \"In Progress\"))","v":"Pending"},0,0,{"$f":"IF(SUMPRODUCT($H$48:BE$48,$H40:BE40)<0.5, \"Pending\", IF(BE40<0.5, \"Complete\", \"In Progress\"))","v":"Pending"},0,0,{"$f":"IF(SUMPRODUCT($H$48:BH$48,$H40:BH40)<0.5, \"Pending\", IF(BH40<0.5, \"Complete\", \"In Progress\"))","v":"Pending"},0,0,{"$f":"IF(SUMPRODUCT($H$48:BK$48,$H40:BK40)<0.5, \"Pending\", IF(BK40<0.5, \"Complete\", \"In Progress\"))","v":"Pending"},0,0,{"$f":"IF(SUMPRODUCT($H$48:BN$48,$H40:BN40)<0.5, \"Pending\", IF(BN40<0.5, \"Complete\", \"In Progress\"))","v":"Pending"},0,0,{"$f":"IF(SUMPRODUCT($H$48:BQ$48,$H40:BQ40)<0.5, \"Pending\", IF(BQ40<0.5, \"Complete\", \"In Progress\"))","v":"Pending"},0,0,{"$f":"IF(SUMPRODUCT($H$48:BT$48,$H40:BT40)<0.5, \"Pending\", IF(BT40<0.5, \"Complete\", \"In Progress\"))","v":"Pending"},0,0,{"$f":"IF(SUMPRODUCT($H$48:BW$48,$H40:BW40)<0.5, \"Pending\", IF(BW40<0.5, \"Complete\", \"In Progress\"))","v":"Pending"},0,0,{"$f":"IF(SUMPRODUCT($H$48:BZ$48,$H40:BZ40)<0.5, \"Pending\", IF(BZ40<0.5, \"Complete\", \"In Progress\"))","v":"Pending"},0,0,{"$f":"IF(SUMPRODUCT($H$48:CC$48,$H40:CC40)<0.5, \"Pending\", IF(CC40<0.5, \"Complete\", \"In Progress\"))","v":"Pending"},0,0,{"$f":"IF(SUMPRODUCT($H$48:CF$48,$H40:CF40)<0.5, \"Pending\", IF(CF40<0.5, \"Complete\", \"In Progress\"))","v":"Pending"},0,0,{"$f":"IF(SUMPRODUCT($H$48:CI$48,$H40:CI40)<0.5, \"Pending\", IF(CI40<0.5, \"Complete\", \"In Progress\"))","v":"Pending"},0,0,{"$f":"IF(SUMPRODUCT($H$48:CL$48,$H40:CL40)<0.5, \"Pending\", IF(CL40<0.5, \"Complete\", \"In Progress\"))","v":"Pending"},0,0,{"$f":"IF(SUMPRODUCT($H$48:CO$48,$H40:CO40)<0.5, \"Pending\", IF(CO40<0.5, \"Complete\", \"In Progress\"))","v":"Pending"},0,0,{"$f":"IF(SUMPRODUCT($H$48:CR$48,$H40:CR40)<0.5, \"Pending\", IF(CR40<0.5, \"Complete\", \"In Progress\"))","v":"Pending"},0,0,{"$f":"IF(SUMPRODUCT($H$48:CU$48,$H40:CU40)<0.5, \"Pending\", IF(CU40<0.5, \"Complete\", \"In Progress\"))","v":"Pending"},0,0,{"$f":"IF(SUMPRODUCT($H$48:CX$48,$H40:CX40)<0.5, \"Pending\", IF(CX40<0.5, \"Complete\", \"In Progress\"))","v":"Pending"},0,0,{"$f":"IF(SUMPRODUCT($H$48:DA$48,$H40:DA40)<0.5, \"Pending\", IF(DA40<0.5, \"Complete\", \"In Progress\"))","v":"Pending"},0,0,{"$f":"IF(SUMPRODUCT($H$48:DD$48,$H40:DD40)<0.5, \"Pending\", IF(DD40<0.5, \"Complete\", \"In Progress\"))","v":"Pending"},0,0,{"$f":"IF(SUMPRODUCT($H$48:DG$48,$H40:DG40)<0.5, \"Pending\", IF(DG40<0.5, \"Complete\", \"In Progress\"))","v":"Pending"},0,0,{"$f":"IF(SUMPRODUCT($H$48:DJ$48,$H40:DJ40)<0.5, \"Pending\", IF(DJ40<0.5, \"Complete\", \"In Progress\"))","v":"Pending"},0,0,{"$f":"IF(SUMPRODUCT($H$48:DM$48,$H40:DM40)<0.5, \"Pending\", IF(DM40<0.5, \"Complete\", \"In Progress\"))","v":"Pending"},0,0,{"$f":"IF(SUMPRODUCT($H$48:DP$48,$H40:DP40)<0.5, \"Pending\", IF(DP40<0.5, \"Complete\", \"In Progress\"))","v":"Pending"},0,0,{"$f":"IF(SUMPRODUCT($H$48:DS$48,$H40:DS40)<0.5, \"Pending\", IF(DS40<0.5, \"Complete\", \"In Progress\"))","v":"Pending"},0,0,{"$f":"IF(SUMPRODUCT($H$48:DV$48,$H40:DV40)<0.5, \"Pending\", IF(DV40<0.5, \"Complete\", \"In Progress\"))","v":"Pending"},null,{"$f":"SUMPRODUCT($F$48:DE$48,$F40:DE40)","v":0}]
[null,null,null,"unassigned","Pending",1,0,0,0,{"$f":"IF(SUMPRODUCT($H$48:I$48,$H41:I41)<0.5, \"Pending\", IF(I41<0.5, \"Complete\", \"In Progress\"))","v":"Pending"},0,0,{"$f":"IF(SUMPRODUCT($H$48:L$48,$H41:L41)<0.5, \"Pending\", IF(L41<0.5, \"Complete\", \"In Progress\"))","v":"Pending"},0,0,{"$f":"IF(SUMPRODUCT($H$48:O$48,$H41:O41)<0.5, \"Pending\", IF(O41<0.5, \"Complete\", \"In Progress\"))","v":"Pending"},0,0,{"$f":"IF(SUMPRODUCT($H$48:R$48,$H41:R41)<0.5, \"Pending\", IF(R41<0.5, \"Complete\", \"In Progress\"))","v":"Pending"},0,0,{"$f":"IF(SUMPRODUCT($H$48:U$48,$H41:U41)<0.5, \"Pending\", IF(U41<0.5, \"Complete\", \"In Progress\"))","v":"Pending"},0,0,{"$f":"IF(SUMPRODUCT($H$48:X$48,$H41:X41)<0.5, \"Pending\", IF(X41<0.5, \"Complete\", \"In Progress\"))","v":"Pending"},0,0,{"$f":"IF(SUMPRODUCT($H$48:AA$48,$H41:AA41)<0.5, \"Pending\", IF(AA41<0.5, \"Complete\", \"In Progress\"))","v":"Pending"},0,0,{"$f":"IF(SUMPRODUCT($H$48:AD$48,$H41:AD41)<0.5, \"Pending\", IF(AD41<0.5, \"Complete\", \"In Progress\"))","v":"Pending"},0,0,{"$f":"IF(SUMPRODUCT($H$48:AG$48,$H41:AG41)<0.5, \"Pending\", IF(AG41<0.5, \"Complete\", \"In Progress\"))","v":"Pending"},0,0,{"$f":"IF(SUMPRODUCT($H$48:AJ$48,$H41:AJ41)<0.5, \"Pending\", IF(AJ41<0.5, \"Complete\", \"In Progress\"))","v":"Pending"},0,0,{"$f":"IF(SUMPRODUCT($H$48:AM$48,$H41:AM41)<0.5, \"Pending\", IF(AM41<0.5, \"Complete\", \"In Progress\"))","v":"Pending"},0,0,{"$f":"IF(SUMPRODUCT($H$48:AP$48,$H41:AP41)<0.5, \"Pending\", IF(AP41<0.5, \"Complete\", \"In Progress\"))","v":"Pending"},0,0,{"$f":"IF(SUMPRODUCT($H$48:AS$48,$H41:AS41)<0.5, \"Pending\", IF(AS41<0.5, \"Complete\", \"In Progress\"))","v":"Pending"},0,0,{"$f":"IF(SUMPRODUCT($H$48:AV$48,$H41:AV41)<0.5, \"Pending\", IF(AV41<0.5, \"Complete\", \"In Progress\"))","v":"Pending"},0,0,{"$f":"IF(SUMPRODUCT($H$48:AY$48,$H41:AY41)<0.5, \"Pending\", IF(AY41<0.5, \"Complete\", \"In Progress\"))","v":"Pending"},0,0,{"$f":"IF(SUMPRODUCT($H$48:BB$48,$H41:BB41)<0.5, \"Pending\", IF(BB41<0.5, \"Complete\", \"In Progress\"))","v":"Pending"},0,0,{"$f":"IF(SUMPRODUCT($H$48:BE$48,$H41:BE41)<0.5, \"Pending\", IF(BE41<0.5, \"Complete\", \"In Progress\"))","v":"Pending"},0,0,{"$f":"IF(SUMPRODUCT($H$48:BH$48,$H41:BH41)<0.5, \"Pending\", IF(BH41<0.5, \"Complete\", \"In Progress\"))","v":"Pending"},0,0,{"$f":"IF(SUMPRODUCT($H$48:BK$48,$H41:BK41)<0.5, \"Pending\", IF(BK41<0.5, \"Complete\", \"In Progress\"))","v":"Pending"},0,0,{"$f":"IF(SUMPRODUCT($H$48:BN$48,$H41:BN41)<0.5, \"Pending\", IF(BN41<0.5, \"Complete\", \"In Progress\"))","v":"Pending"},0,0,{"$f":"IF(SUMPRODUCT($H$48:BQ$48,$H41:BQ41)<0.5, \"Pending\", IF(BQ41<0.5, \"Complete\", \"In Progress\"))","v":"Pending"},0,0,{"$f":"IF(SUMPRODUCT($H$48:BT$48,$H41:BT41)<0.5, \"Pending\", IF(BT41<0.5, \"Complete\", \"In Progress\"))","v":"Pending"},0,0,{"$f":"IF(SUMPRODUCT($H$48:BW$48,$H41:BW41)<0.5, \"Pending\", IF(BW41<0.5, \"Complete\", \"In Progress\"))","v":"Pending"},0,0,{"$f":"IF(SUMPRODUCT($H$48:BZ$48,$H41:BZ41)<0.5, \"Pending\", IF(BZ41<0.5, \"Complete\", \"In Progress\"))","v":"Pending"},0,0,{"$f":"IF(SUMPRODUCT($H$48:CC$48,$H41:CC41)<0.5, \"Pending\", IF(CC41<0.5, \"Complete\", \"In Progress\"))","v":"Pending"},0,0,{"$f":"IF(SUMPRODUCT($H$48:CF$48,$H41:CF41)<0.5, \"Pending\", IF(CF41<0.5, \"Complete\", \"In Progress\"))","v":"Pending"},0,0,{"$f":"IF(SUMPRODUCT($H$48:CI$48,$H41:CI41)<0.5, \"Pending\", IF(CI41<0.5, \"Complete\", \"In Progress\"))","v":"Pending"},0,0,{"$f":"IF(SUMPRODUCT($H$48:CL$48,$H41:CL41)<0.5, \"Pending\", IF(CL41<0.5, \"Complete\", \"In Progress\"))","v":"Pending"},0,0,{"$f":"IF(SUMPRODUCT($H$48:CO$48,$H41:CO41)<0.5, \"Pending\", IF(CO41<0.5, \"Complete\", \"In Progress\"))","v":"Pending"},0,0,{"$f":"IF(SUMPRODUCT($H$48:CR$48,$H41:CR41)<0.5, \"Pending\", IF(CR41<0.5, \"Complete\", \"In Progress\"))","v":"Pending"},0,0,{"$f":"IF(SUMPRODUCT($H$48:CU$48,$H41:CU41)<0.5, \"Pending\", IF(CU41<0.5, \"Complete\", \"In Progress\"))","v":"Pending"},0,0,{"$f":"IF(SUMPRODUCT($H$48:CX$48,$H41:CX41)<0.5, \"Pending\", IF(CX41<0.5, \"Complete\", \"In Progress\"))","v":"Pending"},0,0,{"$f":"IF(SUMPRODUCT($H$48:DA$48,$H41:DA41)<0.5, \"Pending\", IF(DA41<0.5, \"Complete\", \"In Progress\"))","v":"Pending"},0,0,{"$f":"IF(SUMPRODUCT($H$48:DD$48,$H41:DD41)<0.5, \"Pending\", IF(DD41<0.5, \"Complete\", \"In Progress\"))","v":"Pending"},0,0,{"$f":"IF(SUMPRODUCT($H$48:DG$48,$H41:DG41)<0.5, \"Pending\", IF(DG41<0.5, \"Complete\", \"In Progress\"))","v":"Pending"},0,0,{"$f":"IF(SUMPRODUCT($H$48:DJ$48,$H41:DJ41)<0.5, \"Pending\", IF(DJ41<0.5, \"Complete\", \"In Progress\"))","v":"Pending"},0,0,{"$f":"IF(SUMPRODUCT($H$48:DM$48,$H41:DM41)<0.5, \"Pending\", IF(DM41<0.5, \"Complete\", \"In Progress\"))","v":"Pending"},0,0,{"$f":"IF(SUMPRODUCT($H$48:DP$48,$H41:DP41)<0.5, \"Pending\", IF(DP41<0.5, \"Complete\", \"In Progress\"))","v":"Pending"},0,0,{"$f":"IF(SUMPRODUCT($H$48:DS$48,$H41:DS41)<0.5, \"Pending\", IF(DS41<0.5, \"Complete\", \"In Progress\"))","v":"Pending"},0,0,{"$f":"IF(SUMPRODUCT($H$48:DV$48,$H41:DV41)<0.5, \"Pending\", IF(DV41<0.5, \"Complete\", \"In Progress\"))","v":"Pending"},null,{"$f":"SUMPRODUCT($F$48:DE$48,$F41:DE41)","v":0}]
[null,null,null,"unassigned","Pending",1,0,0,0,{"$f":"IF(SUMPRODUCT($H$48:I$48,$H42:I42)<0.5, \"Pending\", IF(I42<0.5, \"Complete\", \"In Progress\"))","v":"Pending"},0,0,{"$f":"IF(SUMPRODUCT($H$48:L$48,$H42:L42)<0.5, \"Pending\", IF(L42<0.5, \"Complete\", \"In Progress\"))","v":"Pending"},0,0,{"$f":"IF(SUMPRODUCT($H$48:O$48,$H42:O42)<0.5, \"Pending\", IF(O42<0.5, \"Complete\", \"In Progress\"))","v":"Pending"},0,0,{"$f":"IF(SUMPRODUCT($H$48:R$48,$H42:R42)<0.5, \"Pending\", IF(R42<0.5, \"Complete\", \"In Progress\"))","v":"Pending"},0,0,{"$f":"IF(SUMPRODUCT($H$48:U$48,$H42:U42)<0.5, \"Pending\", IF(U42<0.5, \"Complete\", \"In Progress\"))","v":"Pending"},0,0,{"$f":"IF(SUMPRODUCT($H$48:X$48,$H42:X42)<0.5, \"Pending\", IF(X42<0.5, \"Complete\", \"In Progress\"))","v":"Pending"},0,0,{"$f":"IF(SUMPRODUCT($H$48:AA$48,$H42:AA42)<0.5, \"Pending\", IF(AA42<0.5, \"Complete\", \"In Progress\"))","v":"Pending"},0,0,{"$f":"IF(SUMPRODUCT($H$48:AD$48,$H42:AD42)<0.5, \"Pending\", IF(AD42<0.5, \"Complete\", \"In Progress\"))","v":"Pending"},0,0,{"$f":"IF(SUMPRODUCT($H$48:AG$48,$H42:AG42)<0.5, \"Pending\", IF(AG42<0.5, \"Complete\", \"In Progress\"))","v":"Pending"},0,0,{"$f":"IF(SUMPRODUCT($H$48:AJ$48,$H42:AJ42)<0.5, \"Pending\", IF(AJ42<0.5, \"Complete\", \"In Progress\"))","v":"Pending"},0,0,{"$f":"IF(SUMPRODUCT($H$48:AM$48,$H42:AM42)<0.5, \"Pending\", IF(AM42<0.5, \"Complete\", \"In Progress\"))","v":"Pending"},0,0,{"$f":"IF(SUMPRODUCT($H$48:AP$48,$H42:AP42)<0.5, \"Pending\", IF(AP42<0.5, \"Complete\", \"In Progress\"))","v":"Pending"},0,0,{"$f":"IF(SUMPRODUCT($H$48:AS$48,$H42:AS42)<0.5, \"Pending\", IF(AS42<0.5, \"Complete\", \"In Progress\"))","v":"Pending"},0,0,{"$f":"IF(SUMPRODUCT($H$48:AV$48,$H42:AV42)<0.5, \"Pending\", IF(AV42<0.5, \"Complete\", \"In Progress\"))","v":"Pending"},0,0,{"$f":"IF(SUMPRODUCT($H$48:AY$48,$H42:AY42)<0.5, \"Pending\", IF(AY42<0.5, \"Complete\", \"In Progress\"))","v":"Pending"},0,0,{"$f":"IF(SUMPRODUCT($H$48:BB$48,$H42:BB42)<0.5, \"Pending\", IF(BB42<0.5, \"Complete\", \"In Progress\"))","v":"Pending"},0,0,{"$f":"IF(SUMPRODUCT($H$48:BE$48,$H42:BE42)<0.5, \"Pending\", IF(BE42<0.5, \"Complete\", \"In Progress\"))","v":"Pending"},0,0,{"$f":"IF(SUMPRODUCT($H$48:BH$48,$H42:BH42)<0.5, \"Pending\", IF(BH42<0.5, \"Complete\", \"In Progress\"))","v":"Pending"},0,0,{"$f":"IF(SUMPRODUCT($H$48:BK$48,$H42:BK42)<0.5, \"Pending\", IF(BK42<0.5, \"Complete\", \"In Progress\"))","v":"Pending"},0,0,{"$f":"IF(SUMPRODUCT($H$48:BN$48,$H42:BN42)<0.5, \"Pending\", IF(BN42<0.5, \"Complete\", \"In Progress\"))","v":"Pending"},0,0,{"$f":"IF(SUMPRODUCT($H$48:BQ$48,$H42:BQ42)<0.5, \"Pending\", IF(BQ42<0.5, \"Complete\", \"In Progress\"))","v":"Pending"},0,0,{"$f":"IF(SUMPRODUCT($H$48:BT$48,$H42:BT42)<0.5, \"Pending\", IF(BT42<0.5, \"Complete\", \"In Progress\"))","v":"Pending"},0,0,{"$f":"IF(SUMPRODUCT($H$48:BW$48,$H42:BW42)<0.5, \"Pending\", IF(BW42<0.5, \"Complete\", \"In Progress\"))","v":"Pending"},0,0,{"$f":"IF(SUMPRODUCT($H$48:BZ$48,$H42:BZ42)<0.5, \"Pending\", IF(BZ42<0.5, \"Complete\", \"In Progress\"))","v":"Pending"},0,0,{"$f":"IF(SUMPRODUCT($H$48:CC$48,$H42:CC42)<0.5, \"Pending\", IF(CC42<0.5, \"Complete\", \"In Progress\"))","v":"Pending"},0,0,{"$f":"IF(SUMPRODUCT($H$48:CF$48,$H42:CF42)<0.5, \"Pending\", IF(CF42<0.5, \"Complete\", \"In Progress\"))","v":"Pending"},0,0,{"$f":"IF(SUMPRODUCT($H$48:CI$48,$H42:CI42)<0.5, \"Pending\", IF(CI42<0.5, \"Complete\", \"In Progress\"))","v":"Pending"},0,0,{"$f":"IF(SUMPRODUCT($H$48:CL$48,$H42:CL42)<0.5, \"Pending\", IF(CL42<0.5, \"Complete\", \"In Progress\"))","v":"Pending"},0,0,{"$f":"IF(SUMPRODUCT($H$48:CO$48,$H42:CO42)<0.5, \"Pending\", IF(CO42<0.5, \"Complete\", \"In Progress\"))","v":"Pending"},0,0,{"$f":"IF(SUMPRODUCT($H$48:CR$48,$H42:CR42)<0.5, \"Pending\", IF(CR42<0.5, \"Complete\", \"In Progress\"))","v":"Pending"},0,0,{"$f":"IF(SUMPRODUCT($H$48:CU$48,$H42:CU42)<0.5, \"Pending\", IF(CU42<0.5, \"Complete\", \"In Progress\"))","v":"Pending"},0,0,{"$f":"IF(SUMPRODUCT($H$48:CX$48,$H42:CX42)<0.5, \"Pending\", IF(CX42<0.5, \"Complete\", \"In Progress\"))","v":"Pending"},0,0,{"$f":"IF(SUMPRODUCT($H$48:DA$48,$H42:DA42)<0.5, \"Pending\", IF(DA42<0.5, \"Complete\", \"In Progress\"))","v":"Pending"},0,0,{"$f":"IF(SUMPRODUCT($H$48:DD$48,$H42:DD42)<0.5, \"Pending\", IF(DD42<0.5, \"Complete\", \"In Progress\"))","v":"Pending"},0,0,{"$f":"IF(SUMPRODUCT($H$48:DG$48,$H42:DG42)<0.5, \"Pending\", IF(DG42<0.5, \"Complete\", \"In Progress\"))","v":"Pending"},0,0,{"$f":"IF(SUMPRODUCT($H$48:DJ$48,$H42:DJ42)<0.5, \"Pending\", IF(DJ42<0.5, \"Complete\", \"In Progress\"))","v":"Pending"},0,0,{"$f":"IF(SUMPRODUCT($H$48:DM$48,$H42:DM42)<0.5, \"Pending\", IF(DM42<0.5, \"Complete\", \"In Progress\"))","v":"Pending"},0,0,{"$f":"IF(SUMPRODUCT($H$48:DP$48,$H42:DP42)<0.5, \"Pending\", IF(DP42<0.5, \"Complete\", \"In Progress\"))","v":"Pending"},0,0,{"$f":"IF(SUMPRODUCT($H$48:DS$48,$H42:DS42)<0.5, \"Pending\", IF(DS42<0.5, \"Complete\", \"In Progress\"))","v":"Pending"},0,0,{"$f":"IF(SUMPRODUCT($H$48:DV$48,$H42:DV42)<0.5, \"Pending\", IF(DV42<0.5, \"Complete\", \"In Progress\"))","v":"Pending"},null,{"$f":"SUMPRODUCT($F$48:DE$48,$F42:DE42)","v":0}]
[null,null,null,"unassigned","Pending",1,0,0,0,{"$f":"IF(SUMPRODUCT($H$48:I$48,$H43:I43)<0.5, \"Pending\", IF(I43<0.5, \"Complete\", \"In Progress\"))","v":"Pending"},0,0,{"$f":"IF(SUMPRODUCT($H$48:L$48,$H43:L43)<0.5, \"Pending\", IF(L43<0.5, \"Complete\", \"In Progress\"))","v":"Pending"},0,0,{"$f":"IF(SUMPRODUCT($H$48:O$48,$H43:O43)<0.5, \"Pending\", IF(O43<0.5, \"Complete\", \"In Progress\"))","v":"Pending"},0,0,{"$f":"IF(SUMPRODUCT($H$48:R$48,$H43:R43)<0.5, \"Pending\", IF(R43<0.5, \"Complete\", \"In Progress\"))","v":"Pending"},0,0,{"$f":"IF(SUMPRODUCT($H$48:U$48,$H43:U43)<0.5, \"Pending\", IF(U43<0.5, \"Complete\", \"In Progress\"))","v":"Pending"},0,0,{"$f":"IF(SUMPRODUCT($H$48:X$48,$H43:X43)<0.5, \"Pending\", IF(X43<0.5, \"Complete\", \"In Progress\"))","v":"Pending"},0,0,{"$f":"IF(SUMPRODUCT($H$48:AA$48,$H43:AA43)<0.5, \"Pending\", IF(AA43<0.5, \"Complete\", \"In Progress\"))","v":"Pending"},0,0,{"$f":"IF(SUMPRODUCT($H$48:AD$48,$H43:AD43)<0.5, \"Pending\", IF(AD43<0.5, \"Complete\", \"In Progress\"))","v":"Pending"},0,0,{"$f":"IF(SUMPRODUCT($H$48:AG$48,$H43:AG43)<0.5, \"Pending\", IF(AG43<0.5, \"Complete\", \"In Progress\"))","v":"Pending"},0,0,{"$f":"IF(SUMPRODUCT($H$48:AJ$48,$H43:AJ43)<0.5, \"Pending\", IF(AJ43<0.5, \"Complete\", \"In Progress\"))","v":"Pending"},0,0,{"$f":"IF(SUMPRODUCT($H$48:AM$48,$H43:AM43)<0.5, \"Pending\", IF(AM43<0.5, \"Complete\", \"In Progress\"))","v":"Pending"},0,0,{"$f":"IF(SUMPRODUCT($H$48:AP$48,$H43:AP43)<0.5, \"Pending\", IF(AP43<0.5, \"Complete\", \"In Progress\"))","v":"Pending"},0,0,{"$f":"IF(SUMPRODUCT($H$48:AS$48,$H43:AS43)<0.5, \"Pending\", IF(AS43<0.5, \"Complete\", \"In Progress\"))","v":"Pending"},0,0,{"$f":"IF(SUMPRODUCT($H$48:AV$48,$H43:AV43)<0.5, \"Pending\", IF(AV43<0.5, \"Complete\", \"In Progress\"))","v":"Pending"},0,0,{"$f":"IF(SUMPRODUCT($H$48:AY$48,$H43:AY43)<0.5, \"Pending\", IF(AY43<0.5, \"Complete\", \"In Progress\"))","v":"Pending"},0,0,{"$f":"IF(SUMPRODUCT($H$48:BB$48,$H43:BB43)<0.5, \"Pending\", IF(BB43<0.5, \"Complete\", \"In Progress\"))","v":"Pending"},0,0,{"$f":"IF(SUMPRODUCT($H$48:BE$48,$H43:BE43)<0.5, \"Pending\", IF(BE43<0.5, \"Complete\", \"In Progress\"))","v":"Pending"},0,0,{"$f":"IF(SUMPRODUCT($H$48:BH$48,$H43:BH43)<0.5, \"Pending\", IF(BH43<0.5, \"Complete\", \"In Progress\"))","v":"Pending"},0,0,{"$f":"IF(SUMPRODUCT($H$48:BK$48,$H43:BK43)<0.5, \"Pending\", IF(BK43<0.5, \"Complete\", \"In Progress\"))","v":"Pending"},0,0,{"$f":"IF(SUMPRODUCT($H$48:BN$48,$H43:BN43)<0.5, \"Pending\", IF(BN43<0.5, \"Complete\", \"In Progress\"))","v":"Pending"},0,0,{"$f":"IF(SUMPRODUCT($H$48:BQ$48,$H43:BQ43)<0.5, \"Pending\", IF(BQ43<0.5, \"Complete\", \"In Progress\"))","v":"Pending"},0,0,{"$f":"IF(SUMPRODUCT($H$48:BT$48,$H43:BT43)<0.5, \"Pending\", IF(BT43<0.5, \"Complete\", \"In Progress\"))","v":"Pending"},0,0,{"$f":"IF(SUMPRODUCT($H$48:BW$48,$H43:BW43)<0.5, \"Pending\", IF(BW43<0.5, \"Complete\", \"In Progress\"))","v":"Pending"},0,0,{"$f":"IF(SUMPRODUCT($H$48:BZ$48,$H43:BZ43)<0.5, \"Pending\", IF(BZ43<0.5, \"Complete\", \"In Progress\"))","v":"Pending"},0,0,{"$f":"IF(SUMPRODUCT($H$48:CC$48,$H43:CC43)<0.5, \"Pending\", IF(CC43<0.5, \"Complete\", \"In Progress\"))","v":"Pending"},0,0,{"$f":"IF(SUMPRODUCT($H$48:CF$48,$H43:CF43)<0.5, \"Pending\", IF(CF43<0.5, \"Complete\", \"In Progress\"))","v":"Pending"},0,0,{"$f":"IF(SUMPRODUCT($H$48:CI$48,$H43:CI43)<0.5, \"Pending\", IF(CI43<0.5, \"Complete\", \"In Progress\"))","v":"Pending"},0,0,{"$f":"IF(SUMPRODUCT($H$48:CL$48,$H43:CL43)<0.5, \"Pending\", IF(CL43<0.5, \"Complete\", \"In Progress\"))","v":"Pending"},0,0,{"$f":"IF(SUMPRODUCT($H$48:CO$48,$H43:CO43)<0.5, \"Pending\", IF(CO43<0.5, \"Complete\", \"In Progress\"))","v":"Pending"},0,0,{"$f":"IF(SUMPRODUCT($H$48:CR$48,$H43:CR43)<0.5, \"Pending\", IF(CR43<0.5, \"Complete\", \"In Progress\"))","v":"Pending"},0,0,{"$f":"IF(SUMPRODUCT($H$48:CU$48,$H43:CU43)<0.5, \"Pending\", IF(CU43<0.5, \"Complete\", \"In Progress\"))","v":"Pending"},0,0,{"$f":"IF(SUMPRODUCT($H$48:CX$48,$H43:CX43)<0.5, \"Pending\", IF(CX43<0.5, \"Complete\", \"In Progress\"))","v":"Pending"},0,0,{"$f":"IF(SUMPRODUCT($H$48:DA$48,$H43:DA43)<0.5, \"Pending\", IF(DA43<0.5, \"Complete\", \"In Progress\"))","v":"Pending"},0,0,{"$f":"IF(SUMPRODUCT($H$48:DD$48,$H43:DD43)<0.5, \"Pending\", IF(DD43<0.5, \"Complete\", \"In Progress\"))","v":"Pending"},0,0,{"$f":"IF(SUMPRODUCT($H$48:DG$48,$H43:DG43)<0.5, \"Pending\", IF(DG43<0.5, \"Complete\", \"In Progress\"))","v":"Pending"},0,0,{"$f":"IF(SUMPRODUCT($H$48:DJ$48,$H43:DJ43)<0.5, \"Pending\", IF(DJ43<0.5, \"Complete\", \"In Progress\"))","v":"Pending"},0,0,{"$f":"IF(SUMPRODUCT($H$48:DM$48,$H43:DM43)<0.5, \"Pending\", IF(DM43<0.5, \"Complete\", \"In Progress\"))","v":"Pending"},0,0,{"$f":"IF(SUMPRODUCT($H$48:DP$48,$H43:DP43)<0.5, \"Pending\", IF(DP43<0.5, \"Complete\", \"In Progress\"))","v":"Pending"},0,0,{"$f":"IF(SUMPRODUCT($H$48:DS$48,$H43:DS43)<0.5, \"Pending\", IF(DS43<0.5, \"Complete\", \"In Progress\"))","v":"Pending"},0,0,{"$f":"IF(SUMPRODUCT($H$48:DV$48,$H43:DV43)<0.5, \"Pending\", IF(DV43<0.5, \"Complete\", \"In Progress\"))","v":"Pending"},null,{"$f":"SUMPRODUCT($F$48:DE$48,$F43:DE43)","v":0}]
[null,null,null,"unassigned","Pending",1,0,0,0,{"$f":"IF(SUMPRODUCT($H$48:I$48,$H44:I44)<0.5, \"Pending\", IF(I44<0.5, \"Complete\", \"In Progress\"))","v":"Pending"},0,0,{"$f":"IF(SUMPRODUCT($H$48:L$48,$H44:L44)<0.5, \"Pending\", IF(L44<0.5, \"Complete\", \"In Progress\"))","v":"Pending"},0,0,{"$f":"IF(SUMPRODUCT($H$48:O$48,$H44:O44)<0.5, \"Pending\", IF(O44<0.5, \"Complete\", \"In Progress\"))","v":"Pending"},0,0,{"$f":"IF(SUMPRODUCT($H$48:R$48,$H44:R44)<0.5, \"Pending\", IF(R44<0.5, \"Complete\", \"In Progress\"))","v":"Pending"},0,0,{"$f":"IF(SUMPRODUCT($H$48:U$48,$H44:U44)<0.5, \"Pending\", IF(U44<0.5, \"Complete\", \"In Progress\"))","v":"Pending"},0,0,{"$f":"IF(SUMPRODUCT($H$48:X$48,$H44:X44)<0.5, \"Pending\", IF(X44<0.5, \"Complete\", \"In Progress\"))","v":"Pending"},0,0,{"$f":"IF(SUMPRODUCT($H$48:AA$48,$H44:AA44)<0.5, \"Pending\", IF(AA44<0.5, \"Complete\", \"In Progress\"))","v":"Pending"},0,0,{"$f":"IF(SUMPRODUCT($H$48:AD$48,$H44:AD44)<0.5, \"Pending\", IF(AD44<0.5, \"Complete\", \"In Progress\"))","v":"Pending"},0,0,{"$f":"IF(SUMPRODUCT($H$48:AG$48,$H44:AG44)<0.5, \"Pending\", IF(AG44<0.5, \"Complete\", \"In Progress\"))","v":"Pending"},0,0,{"$f":"IF(SUMPRODUCT($H$48:AJ$48,$H44:AJ44)<0.5, \"Pending\", IF(AJ44<0.5, \"Complete\", \"In Progress\"))","v":"Pending"},0,0,{"$f":"IF(SUMPRODUCT($H$48:AM$48,$H44:AM44)<0.5, \"Pending\", IF(AM44<0.5, \"Complete\", \"In Progress\"))","v":"Pending"},0,0,{"$f":"IF(SUMPRODUCT($H$48:AP$48,$H44:AP44)<0.5, \"Pending\", IF(AP44<0.5, \"Complete\", \"In Progress\"))","v":"Pending"},0,0,{"$f":"IF(SUMPRODUCT($H$48:AS$48,$H44:AS44)<0.5, \"Pending\", IF(AS44<0.5, \"Complete\", \"In Progress\"))","v":"Pending"},0,0,{"$f":"IF(SUMPRODUCT($H$48:AV$48,$H44:AV44)<0.5, \"Pending\", IF(AV44<0.5, \"Complete\", \"In Progress\"))","v":"Pending"},0,0,{"$f":"IF(SUMPRODUCT($H$48:AY$48,$H44:AY44)<0.5, \"Pending\", IF(AY44<0.5, \"Complete\", \"In Progress\"))","v":"Pending"},0,0,{"$f":"IF(SUMPRODUCT($H$48:BB$48,$H44:BB44)<0.5, \"Pending\", IF(BB44<0.5, \"Complete\", \"In Progress\"))","v":"Pending"},0,0,{"$f":"IF(SUMPRODUCT($H$48:BE$48,$H44:BE44)<0.5, \"Pending\", IF(BE44<0.5, \"Complete\", \"In Progress\"))","v":"Pending"},0,0,{"$f":"IF(SUMPRODUCT($H$48:BH$48,$H44:BH44)<0.5, \"Pending\", IF(BH44<0.5, \"Complete\", \"In Progress\"))","v":"Pending"},0,0,{"$f":"IF(SUMPRODUCT($H$48:BK$48,$H44:BK44)<0.5, \"Pending\", IF(BK44<0.5, \"Complete\", \"In Progress\"))","v":"Pending"},0,0,{"$f":"IF(SUMPRODUCT($H$48:BN$48,$H44:BN44)<0.5, \"Pending\", IF(BN44<0.5, \"Complete\", \"In Progress\"))","v":"Pending"},0,0,{"$f":"IF(SUMPRODUCT($H$48:BQ$48,$H44:BQ44)<0.5, \"Pending\", IF(BQ44<0.5, \"Complete\", \"In Progress\"))","v":"Pending"},0,0,{"$f":"IF(SUMPRODUCT($H$48:BT$48,$H44:BT44)<0.5, \"Pending\", IF(BT44<0.5, \"Complete\", \"In Progress\"))","v":"Pending"},0,0,{"$f":"IF(SUMPRODUCT($H$48:BW$48,$H44:BW44)<0.5, \"Pending\", IF(BW44<0.5, \"Complete\", \"In Progress\"))","v":"Pending"},0,0,{"$f":"IF(SUMPRODUCT($H$48:BZ$48,$H44:BZ44)<0.5, \"Pending\", IF(BZ44<0.5, \"Complete\", \"In Progress\"))","v":"Pending"},0,0,{"$f":"IF(SUMPRODUCT($H$48:CC$48,$H44:CC44)<0.5, \"Pending\", IF(CC44<0.5, \"Complete\", \"In Progress\"))","v":"Pending"},0,0,{"$f":"IF(SUMPRODUCT($H$48:CF$48,$H44:CF44)<0.5, \"Pending\", IF(CF44<0.5, \"Complete\", \"In Progress\"))","v":"Pending"},0,0,{"$f":"IF(SUMPRODUCT($H$48:CI$48,$H44:CI44)<0.5, \"Pending\", IF(CI44<0.5, \"Complete\", \"In Progress\"))","v":"Pending"},0,0,{"$f":"IF(SUMPRODUCT($H$48:CL$48,$H44:CL44)<0.5, \"Pending\", IF(CL44<0.5, \"Complete\", \"In Progress\"))","v":"Pending"},0,0,{"$f":"IF(SUMPRODUCT($H$48:CO$48,$H44:CO44)<0.5, \"Pending\", IF(CO44<0.5, \"Complete\", \"In Progress\"))","v":"Pending"},0,0,{"$f":"IF(SUMPRODUCT($H$48:CR$48,$H44:CR44)<0.5, \"Pending\", IF(CR44<0.5, \"Complete\", \"In Progress\"))","v":"Pending"},0,0,{"$f":"IF(SUMPRODUCT($H$48:CU$48,$H44:CU44)<0.5, \"Pending\", IF(CU44<0.5, \"Complete\", \"In Progress\"))","v":"Pending"},0,0,{"$f":"IF(SUMPRODUCT($H$48:CX$48,$H44:CX44)<0.5, \"Pending\", IF(CX44<0.5, \"Complete\", \"In Progress\"))","v":"Pending"},0,0,{"$f":"IF(SUMPRODUCT($H$48:DA$48,$H44:DA44)<0.5, \"Pending\", IF(DA44<0.5, \"Complete\", \"In Progress\"))","v":"Pending"},0,0,{"$f":"IF(SUMPRODUCT($H$48:DD$48,$H44:DD44)<0.5, \"Pending\", IF(DD44<0.5, \"Complete\", \"In Progress\"))","v":"Pending"},0,0,{"$f":"IF(SUMPRODUCT($H$48:DG$48,$H44:DG44)<0.5, \"Pending\", IF(DG44<0.5, \"Complete\", \"In Progress\"))","v":"Pending"},0,0,{"$f":"IF(SUMPRODUCT($H$48:DJ$48,$H44:DJ44)<0.5, \"Pending\", IF(DJ44<0.5, \"Complete\", \"In Progress\"))","v":"Pending"},0,0,{"$f":"IF(SUMPRODUCT($H$48:DM$48,$H44:DM44)<0.5, \"Pending\", IF(DM44<0.5, \"Complete\", \"In Progress\"))","v":"Pending"},0,0,{"$f":"IF(SUMPRODUCT($H$48:DP$48,$H44:DP44)<0.5, \"Pending\", IF(DP44<0.5, \"Complete\", \"In Progress\"))","v":"Pending"},0,0,{"$f":"IF(SUMPRODUCT($H$48:DS$48,$H44:DS44)<0.5, \"Pending\", IF(DS44<0.5, \"Complete\", \"In Progress\"))","v":"Pending"},0,0,{"$f":"IF(SUMPRODUCT($H$48:DV$48,$H44:DV44)<0.5, \"Pending\", IF(DV44<0.5, \"Complete\", \"In Progress\"))","v":"Pending"},null,{"$f":"SUMPRODUCT($F$48:DE$48,$F44:DE44)","v":0}]
[null,null,null,"unassigned","Pending",1,0,0,0,{"$f":"IF(SUMPRODUCT($H$48:I$48,$H45:I45)<0.5, \"Pending\", IF(I45<0.5, \"Complete\", \"In Progress\"))","v":"Pending"},0,0,{"$f":"IF(SUMPRODUCT($H$48:L$48,$H45:L45)<0.5, \"Pending\", IF(L45<0.5, \"Complete\", \"In Progress\"))","v":"Pending"},0,0,{"$f":"IF(SUMPRODUCT($H$48:O$48,$H45:O45)<0.5, \"Pending\", IF(O45<0.5, \"Complete\", \"In Progress\"))","v":"Pending"},0,0,{"$f":"IF(SUMPRODUCT($H$48:R$48,$H45:R45)<0.5, \"Pending\", IF(R45<0.5, \"Complete\", \"In Progress\"))","v":"Pending"},0,0,{"$f":"IF(SUMPRODUCT($H$48:U$48,$H45:U45)<0.5, \"Pending\", IF(U45<0.5, \"Complete\", \"In Progress\"))","v":"Pending"},0,0,{"$f":"IF(SUMPRODUCT($H$48:X$48,$H45:X45)<0.5, \"Pending\", IF(X45<0.5, \"Complete\", \"In Progress\"))","v":"Pending"},0,0,{"$f":"IF(SUMPRODUCT($H$48:AA$48,$H45:AA45)<0.5, \"Pending\", IF(AA45<0.5, \"Complete\", \"In Progress\"))","v":"Pending"},0,0,{"$f":"IF(SUMPRODUCT($H$48:AD$48,$H45:AD45)<0.5, \"Pending\", IF(AD45<0.5, \"Complete\", \"In Progress\"))","v":"Pending"},0,0,{"$f":"IF(SUMPRODUCT($H$48:AG$48,$H45:AG45)<0.5, \"Pending\", IF(AG45<0.5, \"Complete\", \"In Progress\"))","v":"Pending"},0,0,{"$f":"IF(SUMPRODUCT($H$48:AJ$48,$H45:AJ45)<0.5, \"Pending\", IF(AJ45<0.5, \"Complete\", \"In Progress\"))","v":"Pending"},0,0,{"$f":"IF(SUMPRODUCT($H$48:AM$48,$H45:AM45)<0.5, \"Pending\", IF(AM45<0.5, \"Complete\", \"In Progress\"))","v":"Pending"},0,0,{"$f":"IF(SUMPRODUCT($H$48:AP$48,$H45:AP45)<0.5, \"Pending\", IF(AP45<0.5, \"Complete\", \"In Progress\"))","v":"Pending"},0,0,{"$f":"IF(SUMPRODUCT($H$48:AS$48,$H45:AS45)<0.5, \"Pending\", IF(AS45<0.5, \"Complete\", \"In Progress\"))","v":"Pending"},0,0,{"$f":"IF(SUMPRODUCT($H$48:AV$48,$H45:AV45)<0.5, \"Pending\", IF(AV45<0.5, \"Complete\", \"In Progress\"))","v":"Pending"},0,0,{"$f":"IF(SUMPRODUCT($H$48:AY$48,$H45:AY45)<0.5, \"Pending\", IF(AY45<0.5, \"Complete\", \"In Progress\"))","v":"Pending"},0,0,{"$f":"IF(SUMPRODUCT($H$48:BB$48,$H45:BB45)<0.5, \"Pending\", IF(BB45<0.5, \"Complete\", \"In Progress\"))","v":"Pending"},0,0,{"$f":"IF(SUMPRODUCT($H$48:BE$48,$H45:BE45)<0.5, \"Pending\", IF(BE45<0.5, \"Complete\", \"In Progress\"))","v":"Pending"},0,0,{"$f":"IF(SUMPRODUCT($H$48:BH$48,$H45:BH45)<0.5, \"Pending\", IF(BH45<0.5, \"Complete\", \"In Progress\"))","v":"Pending"},0,0,{"$f":"IF(SUMPRODUCT($H$48:BK$48,$H45:BK45)<0.5, \"Pending\", IF(BK45<0.5, \"Complete\", \"In Progress\"))","v":"Pending"},0,0,{"$f":"IF(SUMPRODUCT($H$48:BN$48,$H45:BN45)<0.5, \"Pending\", IF(BN45<0.5, \"Complete\", \"In Progress\"))","v":"Pending"},0,0,{"$f":"IF(SUMPRODUCT($H$48:BQ$48,$H45:BQ45)<0.5, \"Pending\", IF(BQ45<0.5, \"Complete\", \"In Progress\"))","v":"Pending"},0,0,{"$f":"IF(SUMPRODUCT($H$48:BT$48,$H45:BT45)<0.5, \"Pending\", IF(BT45<0.5, \"Complete\", \"In Progress\"))","v":"Pending"},0,0,{"$f":"IF(SUMPRODUCT($H$48:BW$48,$H45:BW45)<0.5, \"Pending\", IF(BW45<0.5, \"Complete\", \"In Progress\"))","v":"Pending"},0,0,{"$f":"IF(SUMPRODUCT($H$48:BZ$48,$H45:BZ45)<0.5, \"Pending\", IF(BZ45<0.5, \"Complete\", \"In Progress\"))","v":"Pending"},0,0,{"$f":"IF(SUMPRODUCT($H$48:CC$48,$H45:CC45)<0.5, \"Pending\", IF(CC45<0.5, \"Complete\", \"In Progress\"))","v":"Pending"},0,0,{"$f":"IF(SUMPRODUCT($H$48:CF$48,$H45:CF45)<0.5, \"Pending\", IF(CF45<0.5, \"Complete\", \"In Progress\"))","v":"Pending"},0,0,{"$f":"IF(SUMPRODUCT($H$48:CI$48,$H45:CI45)<0.5, \"Pending\", IF(CI45<0.5, \"Complete\", \"In Progress\"))","v":"Pending"},0,0,{"$f":"IF(SUMPRODUCT($H$48:CL$48,$H45:CL45)<0.5, \"Pending\", IF(CL45<0.5, \"Complete\", \"In Progress\"))","v":"Pending"},0,0,{"$f":"IF(SUMPRODUCT($H$48:CO$48,$H45:CO45)<0.5, \"Pending\", IF(CO45<0.5, \"Complete\", \"In Progress\"))","v":"Pending"},0,0,{"$f":"IF(SUMPRODUCT($H$48:CR$48,$H45:CR45)<0.5, \"Pending\", IF(CR45<0.5, \"Complete\", \"In Progress\"))","v":"Pending"},0,0,{"$f":"IF(SUMPRODUCT($H$48:CU$48,$H45:CU45)<0.5, \"Pending\", IF(CU45<0.5, \"Complete\", \"In Progress\"))","v":"Pending"},0,0,{"$f":"IF(SUMPRODUCT($H$48:CX$48,$H45:CX45)<0.5, \"Pending\", IF(CX45<0.5, \"Complete\", \"In Progress\"))","v":"Pending"},0,0,{"$f":"IF(SUMPRODUCT($H$48:DA$48,$H45:DA45)<0.5, \"Pending\", IF(DA45<0.5, \"Complete\", \"In Progress\"))","v":"Pending"},0,0,{"$f":"IF(SUMPRODUCT($H$48:DD$48,$H45:DD45)<0.5, \"Pending\", IF(DD45<0.5, \"Complete\", \"In Progress\"))","v":"Pending"},0,0,{"$f":"IF(SUMPRODUCT($H$48:DG$48,$H45:DG45)<0.5, \"Pending\", IF(DG45<0.5, \"Complete\", \"In Progress\"))","v":"Pending"},0,0,{"$f":"IF(SUMPRODUCT($H$48:DJ$48,$H45:DJ45)<0.5, \"Pending\", IF(DJ45<0.5, \"Complete\", \"In Progress\"))","v":"Pending"},0,0,{"$f":"IF(SUMPRODUCT($H$48:DM$48,$H45:DM45)<0.5, \"Pending\", IF(DM45<0.5, \"Complete\", \"In Progress\"))","v":"Pending"},0,0,{"$f":"IF(SUMPRODUCT($H$48:DP$48,$H45:DP45)<0.5, \"Pending\", IF(DP45<0.5, \"Complete\", \"In Progress\"))","v":"Pending"},0,0,{"$f":"IF(SUMPRODUCT($H$48:DS$48,$H45:DS45)<0.5, \"Pending\", IF(DS45<0.5, \"Complete\", \"In Progress\"))","v":"Pending"},0,0,{"$f":"IF(SUMPRODUCT($H$48:DV$48,$H45:DV45)<0.5, \"Pending\", IF(DV45<0.5, \"Complete\", \"In Progress\"))","v":"Pending"},null,{"$f":"SUMPRODUCT($F$48:DE$48,$F45:DE45)","v":0}]
[null,null,null,null,null,null,null,null,null,null,null,null,null,null,null,null,null,null,null,null,null,null,null,null,null,null,null,null,null,null,null,null,null,null,null,null,null,null,null,null,null,null,null,null,null,null,null,null,null,null,null,null,null,null,null,null,null,null,null,null,null,null,null,null,null,null,null,null,null,null,null,null,null,null,null,null,null,null,null,null,null,null,null,null,null,null,null,null,null,null,null,null,null,null,null,null,null,null,null,null,null,null,null,null,null,null,null,null,null,null,null,null,null,null,null,null,null,null,null,null,null,null,null,null,null,null,null,null,{"$f":"SUMPRODUCT($F$49:DE$49,$F46:DE46)","v":0}]
[null,null,null,null,null,null,null,"Day",null,1,"Day",null,{"$f":"J47+1","v":2},"Day",null,{"$f":"M47+1","v":3},"Day",null,{"$f":"P47+1","v":4},"Day",null,{"$f":"S47+1","v":5},"Day",null,{"$f":"V47+1","v":6},"Day",null,{"$f":"Y47+1","v":7},"Day",null,{"$f":"AB47+1","v":8},"Day",null,{"$f":"AE47+1","v":9},"Day",null,{"$f":"AH47+1","v":10},"Day",null,{"$f":"AK47+1","v":11},"Day",null,{"$f":"AN47+1","v":12},"Day",null,{"$f":"AQ47+1","v":13},"Day",null,{"$f":"AT47+1","v":14},"Day",null,{"$f":"AW47+1","v":15},"Day",null,{"$f":"AZ47+1","v":16},"Day",null,{"$f":"BC47+1","v":17},"Day",null,{"$f":"BF47+1","v":18},"Day",null,{"$f":"BI47+1","v":19},"Day",null,{"$f":"BL47+1","v":20},"Day",null,{"$f":"BO47+1","v":21},"Day",null,{"$f":"BR47+1","v":22},"Day",null,{"$f":"BU47+1","v":23},"Day",null,{"$f":"BX47+1","v":24},"Day",null,{"$f":"CA47+1","v":25},"Day",null,{"$f":"CD47+1","v":26},"Day",null,{"$f":"CG47+1","v":27},"Day",null,{"$f":"CJ47+1","v":28},"Day",null,{"$f":"CM47+1","v":29},"Day",null,{"$f":"CP47+1","v":30},"Day",null,{"$f":"CS47+1","v":31},"Day",null,{"$f":"CV47+1","v":32},"Day",null,{"$f":"CY47+1","v":33},"Day",null,{"$f":"DB47+1","v":34},"Day",null,{"$f":"DE47+1","v":35},"Day",null,{"$f":"DH47+1","v":36},"Day",null,{"$f":"DK47+1","v":37},"Day",null,{"$f":"DN47+1","v":38},"Day",null,{"$f":"DQ47+1","v":39},"Day",null,{"$f":"DT47+1","v":40}]
[null,null,"Time Spent Mask",null,null,null,null,1,0,0,1,0,0,1,0,0,1,0,0,1,0,0,1,0,0,1,0,0,1,0,0,1,0,0,1,0,0,1,0,0,1,0,0,1,0,0,1,0,0,1,0,0,1,0,0,1,0,0,1,0,0,1,0,0,1,0,0,1,0,0,1,0,0,1,0,0,1,0,0,1,0,0,1,0,0,1,0,0,1,0,0,1,0,0,1,0,0,1,0,0,1,0,0,1,0,0,1,0,0,1,0,0,1,0,0,1,0,0,1,0,0,1,0,0,1,0,0]
[null,null,"Time Left Mask",null,null,null,null,0,1,0,0,1,0,0,1,0,0,1,0,0,1,0,0,1,0,0,1,0,0,1,0,0,1,0,0,1,0,0,1,0,0,1,0,0,1,0,0,1,0,0,1,0,0,1,0,0,1,0,0,1,0,0,1,0,0,1,0,0,1,0,0,1,0,0,1,0,0,1,0,0,1,0,0,1,0,0,1,0,0,1,0,0,1,0,0,1,0,0,1,0,0,1,0,0,1,0,0,1,0,0,1,0,0,1,0,0,1,0,0,1,0,0,1,0,0,1,0]
[null,null,"Status Mask",null,null,null,null,0,0,1,0,0,1,0,0,1,0,0,1,0,0,1,0,0,1,0,0,1,0,0,1,0,0,1,0,0,1,0,0,1,0,0,1,0,0,1,0,0,1,0,0,1,0,0,1,0,0,1,0,0,1,0,0,1,0,0,1,0,0,1,0,0,1,0,0,1,0,0,1,0,0,1,0,0,1,0,0,1,0,0,1,0,0,1,0,0,1,0,0,1,0,0,1,0,0,1,0,0,1,0,0,1,0,0,1,0,0,1,0,0,1,0,0,1,0,0,1]
[300,"56A","Totals",null,null,null,{"$f":"SUBTOTAL(109,G$4:G$46)","v":16},{"$f":"SUBTOTAL(109,H$4:H$46)","v":5},{"$f":"SUBTOTAL(109,I$4:I$45)","v":11},null,{"$f":"SUBTOTAL(109,K$4:K$46)","v":1},{"$f":"SUBTOTAL(109,L$4:L$45)","v":10},null,{"$f":"SUBTOTAL(109,N$4:N$46)","v":1},{"$f":"SUBTOTAL(109,O$4:O$45)","v":9},null,{"$f":"SUBTOTAL(109,Q$4:Q$46)","v":0},{"$f":"SUBTOTAL(109,R$4:R$45)","v":9},null,{"$f":"SUBTOTAL(109,T$4:T$46)","v":0},{"$f":"SUBTOTAL(109,U$4:U$45)","v":9},null,{"$f":"SUBTOTAL(109,W$4:W$46)","v":0},{"$f":"SUBTOTAL(109,X$4:X$45)","v":9},null,{"$f":"SUBTOTAL(109,Z$4:Z$46)","v":0},{"$f":"SUBTOTAL(109,AA$4:AA$45)","v":9},null,{"$f":"SUBTOTAL(109,AC$4:AC$46)","v":0},{"$f":"SUBTOTAL(109,AD$4:AD$45)","v":9},null,{"$f":"SUBTOTAL(109,AF$4:AF$46)","v":0},{"$f":"SUBTOTAL(109,AG$4:AG$45)","v":9},null,{"$f":"SUBTOTAL(109,AI$4:AI$46)","v":0},{"$f":"SUBTOTAL(109,AJ$4:AJ$45)","v":9},null,{"$f":"SUBTOTAL(109,AL$4:AL$46)","v":0},{"$f":"SUBTOTAL(109,AM$4:AM$45)","v":9},null,{"$f":"SUBTOTAL(109,AO$4:AO$46)","v":0},{"$f":"SUBTOTAL(109,AP$4:AP$45)","v":9},null,{"$f":"SUBTOTAL(109,AR$4:AR$46)","v":0},{"$f":"SUBTOTAL(109,AS$4:AS$45)","v":9},null,{"$f":"SUBTOTAL(109,AU$4:AU$46)","v":0},{"$f":"SUBTOTAL(109,AV$4:AV$45)","v":9},null,{"$f":"SUBTOTAL(109,AX$4:AX$46)","v":0},{"$f":"SUBTOTAL(109,AY$4:AY$45)","v":9},null,{"$f":"SUBTOTAL(109,BA$4:BA$46)","v":0},{"$f":"SUBTOTAL(109,BB$4:BB$45)","v":9},null,{"$f":"SUBTOTAL(109,BD$4:BD$46)","v":0},{"$f":"SUBTOTAL(109,BE$4:BE$45)","v":9},null,{"$f":"SUBTOTAL(109,BG$4:BG$46)","v":0},{"$f":"SUBTOTAL(109,BH$4:BH$45)","v":9},null,{"$f":"SUBTOTAL(109,BJ$4:BJ$46)","v":0},{"$f":"SUBTOTAL(109,BK$4:BK$45)","v":9},null,{"$f":"SUBTOTAL(109,BM$4:BM$46)","v":0},{"$f":"SUBTOTAL(109,BN$4:BN$45)","v":9},null,{"$f":"SUBTOTAL(109,BP$4:BP$46)","v":0},{"$f":"SUBTOTAL(109,BQ$4:BQ$45)","v":9},null,{"$f":"SUBTOTAL(109,BS$4:BS$46)","v":0},{"$f":"SUBTOTAL(109,BT$4:BT$45)","v":9},null,{"$f":"SUBTOTAL(109,BV$4:BV$46)","v":0},{"$f":"SUBTOTAL(109,BW$4:BW$45)","v":9},null,{"$f":"SUBTOTAL(109,BY$4:BY$46)","v":0},{"$f":"SUBTOTAL(109,BZ$4:BZ$45)","v":9},null,{"$f":"SUBTOTAL(109,CB$4:CB$46)","v":0},{"$f":"SUBTOTAL(109,CC$4:CC$45)","v":9},null,{"$f":"SUBTOTAL(109,CE$4:CE$46)","v":0},{"$f":"SUBTOTAL(109,CF$4:CF$45)","v":9},null,{"$f":"SUBTOTAL(109,CH$4:CH$46)","v":0},{"$f":"SUBTOTAL(109,CI$4:CI$45)","v":9},null,{"$f":"SUBTOTAL(109,CK$4:CK$46)","v":0},{"$f":"SUBTOTAL(109,CL$4:CL$45)","v":9},null,{"$f":"SUBTOTAL(109,CN$4:CN$46)","v":0},{"$f":"SUBTOTAL(109,CO$4:CO$45)","v":9},null,{"$f":"SUBTOTAL(109,CQ$4:CQ$46)","v":0},{"$f":"SUBTOTAL(109,CR$4:CR$45)","v":9},null,{"$f":"SUBTOTAL(109,CT$4:CT$45)","v":0},9,0,0,9,0,0,9,0,0,9,0,0,9,0,0,9,0,0,9,0,0,9,0,0,9,0,0,9,0]

{"sheet":"Analysis","index":1,"n_rows":47,"n_cols":44,"rows_kept":47,"cut":false,"hidden":false,"merged":[]}
[]
[]
[]
[]
[]
[]
[]
[]
[]
[]
[]
[]
[]
[]
[]
[]
[]
[]
[{"$f":"IF(SkipWeekends, \"Working Day\", \"Calendar Day\")","v":"Calendar Day"},null,null,null,1,2,3,4,5,6,7,8,9,10,11,12,13,14,15,16,17,18,19,20,21,22,23,24,25,26,27,28,29,30,31,32,33,34,35,36,37,38,39,40]
["Date",null,null,null,{"$f":"INDEX(SprintDates,1,(E19-1)*BurndownColumns+1)","v":"2017-05-01"},"2017-05-02","2017-05-03","2017-05-04","2017-05-05","2017-05-06","2017-05-07","2017-05-08","2017-05-09","2017-05-10","2017-05-11","2017-05-12","2017-05-13","2017-05-14","2017-05-15","2017-05-16","2017-05-17","2017-05-18","2017-05-19","2017-05-20","2017-05-21","2017-05-22","2017-05-23","2017-05-24","2017-05-25","2017-05-26","2017-05-27","2017-05-28","2017-05-29","2017-05-30","2017-05-31","2017-06-01","2017-06-02","2017-06-03","2017-06-04","2017-06-05","2017-06-06","2017-06-07","2017-06-08","2017-06-09"]
[]
["Total Hours Remaining",null,null,null,{"$f":"IF(E20>TODAY(), #N/A, SUM(INDEX(Burndown,,(E19-1)*BurndownColumns+HoursLeftColumn)))","v":11},10,9,9,9,9,9,9,9,9,{"$error":"#N/A"},{"$error":"#N/A"},{"$error":"#N/A"},{"$error":"#N/A"},{"$error":"#N/A"},{"$error":"#N/A"},{"$error":"#N/A"},{"$error":"#N/A"},{"$error":"#N/A"},{"$error":"#N/A"},{"$error":"#N/A"},{"$error":"#N/A"},{"$error":"#N/A"},{"$error":"#N/A"},{"$error":"#N/A"},{"$error":"#N/A"},{"$error":"#N/A"},{"$error":"#N/A"},{"$error":"#N/A"},{"$error":"#N/A"},{"$error":"#N/A"},{"$error":"#N/A"},{"$error":"#N/A"},{"$error":"#N/A"},{"$error":"#N/A"},{"$error":"#N/A"},{"$error":"#N/A"},{"$error":"#N/A"},{"$error":"#N/A"},{"$error":"#N/A"}]
["Hours Worked Today",null,null,null,{"$f":"IF(E20>TODAY(), #N/A, SUM(INDEX(Burndown,,(E19-1)*BurndownColumns+HoursSpentColumn)))","v":5},1,1,0,0,0,0,0,0,0,{"$error":"#N/A"},{"$error":"#N/A"},{"$error":"#N/A"},{"$error":"#N/A"},{"$error":"#N/A"},{"$error":"#N/A"},{"$error":"#N/A"},{"$error":"#N/A"},{"$error":"#N/A"},{"$error":"#N/A"},{"$error":"#N/A"},{"$error":"#N/A"},{"$error":"#N/A"},{"$error":"#N/A"},{"$error":"#N/A"},{"$error":"#N/A"},{"$error":"#N/A"},{"$error":"#N/A"},{"$error":"#N/A"},{"$error":"#N/A"},{"$error":"#N/A"},{"$error":"#N/A"},{"$error":"#N/A"},{"$error":"#N/A"},{"$error":"#N/A"},{"$error":"#N/A"},{"$error":"#N/A"},{"$error":"#N/A"},{"$error":"#N/A"},{"$error":"#N/A"}]
["Total Hours Worked To Date",null,null,null,{"$f":"IF(E20>TODAY(), #N/A, SUM($E23:E23))","v":5},{"$f":"IF(F20>TODAY(), #N/A, SUM($E23:F23))","v":6},{"$f":"IF(G20>TODAY(), #N/A, SUM($E23:G23))","v":7},{"$f":"IF(H20>TODAY(), #N/A, SUM($E23:H23))","v":7},{"$f":"IF(I20>TODAY(), #N/A, SUM($E23:I23))","v":7},{"$f":"IF(J20>TODAY(), #N/A, SUM($E23:J23))","v":7},{"$f":"IF(K20>TODAY(), #N/A, SUM($E23:K23))","v":7},{"$f":"IF(L20>TODAY(), #N/A, SUM($E23:L23))","v":7},{"$f":"IF(M20>TODAY(), #N/A, SUM($E23:M23))","v":7},{"$f":"IF(N20>TODAY(), #N/A, SUM($E23:N23))","v":7},{"$f":"IF(O20>TODAY(), #N/A, SUM($E23:O23))","v":{"$error":"#N/A"}},{"$f":"IF(P20>TODAY(), #N/A, SUM($E23:P23))","v":{"$error":"#N/A"}},{"$f":"IF(Q20>TODAY(), #N/A, SUM($E23:Q23))","v":{"$error":"#N/A"}},{"$f":"IF(R20>TODAY(), #N/A, SUM($E23:R23))","v":{"$error":"#N/A"}},{"$f":"IF(S20>TODAY(), #N/A, SUM($E23:S23))","v":{"$error":"#N/A"}},{"$f":"IF(T20>TODAY(), #N/A, SUM($E23:T23))","v":{"$error":"#N/A"}},{"$f":"IF(U20>TODAY(), #N/A, SUM($E23:U23))","v":{"$error":"#N/A"}},{"$f":"IF(V20>TODAY(), #N/A, SUM($E23:V23))","v":{"$error":"#N/A"}},{"$f":"IF(W20>TODAY(), #N/A, SUM($E23:W23))","v":{"$error":"#N/A"}},{"$f":"IF(X20>TODAY(), #N/A, SUM($E23:X23))","v":{"$error":"#N/A"}},{"$f":"IF(Y20>TODAY(), #N/A, SUM($E23:Y23))","v":{"$error":"#N/A"}},{"$f":"IF(Z20>TODAY(), #N/A, SUM($E23:Z23))","v":{"$error":"#N/A"}},{"$f":"IF(AA20>TODAY(), #N/A, SUM($E23:AA23))","v":{"$error":"#N/A"}},{"$f":"IF(AB20>TODAY(), #N/A, SUM($E23:AB23))","v":{"$error":"#N/A"}},{"$f":"IF(AC20>TODAY(), #N/A, SUM($E23:AC23))","v":{"$error":"#N/A"}},{"$f":"IF(AD20>TODAY(), #N/A, SUM($E23:AD23))","v":{"$error":"#N/A"}},{"$f":"IF(AE20>TODAY(), #N/A, SUM($E23:AE23))","v":{"$error":"#N/A"}},{"$f":"IF(AF20>TODAY(), #N/A, SUM($E23:AF23))","v":{"$error":"#N/A"}},{"$f":"IF(AG20>TODAY(), #N/A, SUM($E23:AG23))","v":{"$error":"#N/A"}},{"$f":"IF(AH20>TODAY(), #N/A, SUM($E23:AH23))","v":{"$error":"#N/A"}},{"$f":"IF(AI20>TODAY(), #N/A, SUM($E23:AI23))","v":{"$error":"#N/A"}},{"$f":"IF(AJ20>TODAY(), #N/A, SUM($E23:AJ23))","v":{"$error":"#N/A"}},{"$f":"IF(AK20>TODAY(), #N/A, SUM($E23:AK23))","v":{"$error":"#N/A"}},{"$f":"IF(AL20>TODAY(), #N/A, SUM($E23:AL23))","v":{"$error":"#N/A"}},{"$f":"IF(AM20>TODAY(), #N/A, SUM($E23:AM23))","v":{"$error":"#N/A"}},{"$f":"IF(AN20>TODAY(), #N/A, SUM($E23:AN23))","v":{"$error":"#N/A"}},{"$f":"IF(AO20>TODAY(), #N/A, SUM($E23:AO23))","v":{"$error":"#N/A"}},{"$f":"IF(AP20>TODAY(), #N/A, SUM($E23:AP23))","v":{"$error":"#N/A"}},{"$f":"IF(AQ20>TODAY(), #N/A, SUM($E23:AQ23))","v":{"$error":"#N/A"}},{"$f":"IF(AR20>TODAY(), #N/A, SUM($E23:AR23))","v":{"$error":"#N/A"}}]
["Total Worked & Remaining Hours",null,null,null,{"$f":"IF(E20>TODAY(), #N/A, E22+E24)","v":16},16,16,16,16,16,16,16,16,16,{"$error":"#N/A"},{"$error":"#N/A"},{"$error":"#N/A"},{"$error":"#N/A"},{"$error":"#N/A"},{"$error":"#N/A"},{"$error":"#N/A"},{"$error":"#N/A"},{"$error":"#N/A"},{"$error":"#N/A"},{"$error":"#N/A"},{"$error":"#N/A"},{"$error":"#N/A"},{"$error":"#N/A"},{"$error":"#N/A"},{"$error":"#N/A"},{"$error":"#N/A"},{"$error":"#N/A"},{"$error":"#N/A"},{"$error":"#N/A"},{"$error":"#N/A"},{"$error":"#N/A"},{"$error":"#N/A"},{"$error":"#N/A"},{"$error":"#N/A"},{"$error":"#N/A"},{"$error":"#N/A"},{"$error":"#N/A"},{"$error":"#N/A"},{"$error":"#N/A"}]
[]
["Average Hours Worked Per Day",null,null,null,{"$f":"IF(E20>TODAY(), #N/A, E24/E19)","v":5},3,2.3333333333333335,1.75,1.4,1.1666666666666667,1,0.875,0.77777777777777779,0.7,{"$error":"#N/A"},{"$error":"#N/A"},{"$error":"#N/A"},{"$error":"#N/A"},{"$error":"#N/A"},{"$error":"#N/A"},{"$error":"#N/A"},{"$error":"#N/A"},{"$error":"#N/A"},{"$error":"#N/A"},{"$error":"#N/A"},{"$error":"#N/A"},{"$error":"#N/A"},{"$error":"#N/A"},{"$error":"#N/A"},{"$error":"#N/A"},{"$error":"#N/A"},{"$error":"#N/A"},{"$error":"#N/A"},{"$error":"#N/A"},{"$error":"#N/A"},{"$error":"#N/A"},{"$error":"#N/A"},{"$error":"#N/A"},{"$error":"#N/A"},{"$error":"#N/A"},{"$error":"#N/A"},{"$error":"#N/A"},{"$error":"#N/A"},{"$error":"#N/A"}]
["Estimated Completion Date (Burndown)",null,null,null,{"$f":"IF(E20>TODAY(), #N/A, IF(E27=0, SprintStart, E20 + (E22/E27)))","v":"2017-05-03T04:48:00"},"2017-05-05T08:00:00","2017-05-06T20:34:17.143","2017-05-09T03:25:42.857","2017-05-11T10:17:08.571","2017-05-13T17:08:34.286","2017-05-16","2017-05-18T06:51:25.714","2017-05-20T13:42:51.429","2017-05-22T20:34:17.143",{"$error":"#N/A"},{"$error":"#N/A"},{"$error":"#N/A"},{"$error":"#N/A"},{"$error":"#N/A"},{"$error":"#N/A"},{"$error":"#N/A"},{"$error":"#N/A"},{"$error":"#N/A"},{"$error":"#N/A"},{"$error":"#N/A"},{"$error":"#N/A"},{"$error":"#N/A"},{"$error":"#N/A"},{"$error":"#N/A"},{"$error":"#N/A"},{"$error":"#N/A"},{"$error":"#N/A"},{"$error":"#N/A"},{"$error":"#N/A"},{"$error":"#N/A"},{"$error":"#N/A"},{"$error":"#N/A"},{"$error":"#N/A"},{"$error":"#N/A"},{"$error":"#N/A"},{"$error":"#N/A"},{"$error":"#N/A"},{"$error":"#N/A"},{"$error":"#N/A"}]
["Estimated Completion Date (Task Completion)",null,null,null,{"$f":"IF(E$20>TODAY(), #N/A, IF(E$33>0, SprintStart+((E$25*E$19)/E$33)-1, SprintStart))","v":"2017-05-01"},"2017-05-01","2017-05-01","2017-05-01","2017-05-01","2017-05-01","2017-05-01","2017-05-01","2017-05-01","2017-05-01",{"$error":"#N/A"},{"$error":"#N/A"},{"$error":"#N/A"},{"$error":"#N/A"},{"$error":"#N/A"},{"$error":"#N/A"},{"$error":"#N/A"},{"$error":"#N/A"},{"$error":"#N/A"},{"$error":"#N/A"},{"$error":"#N/A"},{"$error":"#N/A"},{"$error":"#N/A"},{"$error":"#N/A"},{"$error":"#N/A"},{"$error":"#N/A"},{"$error":"#N/A"},{"$error":"#N/A"},{"$error":"#N/A"},{"$error":"#N/A"},{"$error":"#N/A"},{"$error":"#N/A"},{"$error":"#N/A"},{"$error":"#N/A"},{"$error":"#N/A"},{"$error":"#N/A"},{"$error":"#N/A"},{"$error":"#N/A"},{"$error":"#N/A"},{"$error":"#N/A"}]
[]
["Task Hours Pending",null,null,null,{"$f":"IF(E$20>TODAY(), #N/A, SUMIF(INDEX(Burndown,,(E$19-1)*BurndownColumns+StatusColumn), \"=Pending\",INDEX(Burndown,,(E$19-1)*BurndownColumns+HoursLeftColumn)))","v":4},4,4,4,4,4,4,4,4,4,{"$error":"#N/A"},{"$error":"#N/A"},{"$error":"#N/A"},{"$error":"#N/A"},{"$error":"#N/A"},{"$error":"#N/A"},{"$error":"#N/A"},{"$error":"#N/A"},{"$error":"#N/A"},{"$error":"#N/A"},{"$error":"#N/A"},{"$error":"#N/A"},{"$error":"#N/A"},{"$error":"#N/A"},{"$error":"#N/A"},{"$error":"#N/A"},{"$error":"#N/A"},{"$error":"#N/A"},{"$error":"#N/A"},{"$error":"#N/A"},{"$error":"#N/A"},{"$error":"#N/A"},{"$error":"#N/A"},{"$error":"#N/A"},{"$error":"#N/A"},{"$error":"#N/A"},{"$error":"#N/A"},{"$error":"#N/A"},{"$error":"#N/A"},{"$error":"#N/A"}]
["Task Hours In Progress",null,null,null,{"$f":"E$22-E$31+E$24-E$33","v":12},12,12,12,12,12,12,12,12,12,{"$error":"#N/A"},{"$error":"#N/A"},{"$error":"#N/A"},{"$error":"#N/A"},{"$error":"#N/A"},{"$error":"#N/A"},{"$error":"#N/A"},{"$error":"#N/A"},{"$error":"#N/A"},{"$error":"#N/A"},{"$error":"#N/A"},{"$error":"#N/A"},{"$error":"#N/A"},{"$error":"#N/A"},{"$error":"#N/A"},{"$error":"#N/A"},{"$error":"#N/A"},{"$error":"#N/A"},{"$error":"#N/A"},{"$error":"#N/A"},{"$error":"#N/A"},{"$error":"#N/A"},{"$error":"#N/A"},{"$error":"#N/A"},{"$error":"#N/A"},{"$error":"#N/A"},{"$error":"#N/A"},{"$error":"#N/A"},{"$error":"#N/A"},{"$error":"#N/A"}]
["Task Hours Complete",null,null,null,{"$f":"IF(E$20>TODAY(), #N/A, SUMIF(INDEX(Burndown,,(E$19-1)*BurndownColumns+StatusColumn), \"=Complete\",TotalEffort))","v":0},0,0,0,0,0,0,0,0,0,{"$error":"#N/A"},{"$error":"#N/A"},{"$error":"#N/A"},{"$error":"#N/A"},{"$error":"#N/A"},{"$error":"#N/A"},{"$error":"#N/A"},{"$error":"#N/A"},{"$error":"#N/A"},{"$error":"#N/A"},{"$error":"#N/A"},{"$error":"#N/A"},{"$error":"#N/A"},{"$error":"#N/A"},{"$error":"#N/A"},{"$error":"#N/A"},{"$error":"#N/A"},{"$error":"#N/A"},{"$error":"#N/A"},{"$error":"#N/A"},{"$error":"#N/A"},{"$error":"#N/A"},{"$error":"#N/A"},{"$error":"#N/A"},{"$error":"#N/A"},{"$error":"#N/A"},{"$error":"#N/A"},{"$error":"#N/A"},{"$error":"#N/A"},{"$error":"#N/A"}]
[]
["Count of Workitems Pending",null,null,null,{"$f":"IF(E20>TODAY(), #N/A, COUNTIF(INDEX(Burndown,,(E19-1)*BurndownColumns+StatusColumn), \"=Pending\"))","v":40},40,40,40,40,40,40,40,40,40,{"$error":"#N/A"},{"$error":"#N/A"},{"$error":"#N/A"},{"$error":"#N/A"},{"$error":"#N/A"},{"$error":"#N/A"},{"$error":"#N/A"},{"$error":"#N/A"},{"$error":"#N/A"},{"$error":"#N/A"},{"$error":"#N/A"},{"$error":"#N/A"},{"$error":"#N/A"},{"$error":"#N/A"},{"$error":"#N/A"},{"$error":"#N/A"},{"$error":"#N/A"},{"$error":"#N/A"},{"$error":"#N/A"},{"$error":"#N/A"},{"$error":"#N/A"},{"$error":"#N/A"},{"$error":"#N/A"},{"$error":"#N/A"},{"$error":"#N/A"},{"$error":"#N/A"},{"$error":"#N/A"},{"$error":"#N/A"},{"$error":"#N/A"},{"$error":"#N/A"}]
["Count of Workitems In Progress",null,null,null,{"$f":"IF(E20>TODAY(), #N/A, COUNTIF(INDEX(Burndown,,(E19-1)*BurndownColumns+StatusColumn), \"=In Progress\"))","v":2},2,2,2,2,2,2,2,2,2,{"$error":"#N/A"},{"$error":"#N/A"},{"$error":"#N/A"},{"$error":"#N/A"},{"$error":"#N/A"},{"$error":"#N/A"},{"$error":"#N/A"},{"$error":"#N/A"},{"$error":"#N/A"},{"$error":"#N/A"},{"$error":"#N/A"},{"$error":"#N/A"},{"$error":"#N/A"},{"$error":"#N/A"},{"$error":"#N/A"},{"$error":"#N/A"},{"$error":"#N/A"},{"$error":"#N/A"},{"$error":"#N/A"},{"$error":"#N/A"},{"$error":"#N/A"},{"$error":"#N/A"},{"$error":"#N/A"},{"$error":"#N/A"},{"$error":"#N/A"},{"$error":"#N/A"},{"$error":"#N/A"},{"$error":"#N/A"},{"$error":"#N/A"},{"$error":"#N/A"}]
["Count of Workitems Complete",null,null,null,{"$f":"IF(E20>TODAY(), #N/A, COUNTIF(INDEX(Burndown,,(E19-1)*BurndownColumns+StatusColumn), \"=Complete\"))","v":0},0,0,0,0,0,0,0,0,0,{"$error":"#N/A"},{"$error":"#N/A"},{"$error":"#N/A"},{"$error":"#N/A"},{"$error":"#N/A"},{"$error":"#N/A"},{"$error":"#N/A"},{"$error":"#N/A"},{"$error":"#N/A"},{"$error":"#N/A"},{"$error":"#N/A"},{"$error":"#N/A"},{"$error":"#N/A"},{"$error":"#N/A"},{"$error":"#N/A"},{"$error":"#N/A"},{"$error":"#N/A"},{"$error":"#N/A"},{"$error":"#N/A"},{"$error":"#N/A"},{"$error":"#N/A"},{"$error":"#N/A"},{"$error":"#N/A"},{"$error":"#N/A"},{"$error":"#N/A"},{"$error":"#N/A"},{"$error":"#N/A"},{"$error":"#N/A"},{"$error":"#N/A"},{"$error":"#N/A"}]
[]
["Workbook Settings",null,null,null,null,null,"Comments"]
[null,"SkipWeekends",null,null,0,null,"(0=30 calendar days; 1=30 working days). Set to 1 to have dates skip over weekends (30 working day sprint, >30 calendar day sprint). Do not switch after Sprint has started or data will be stored under wrong days "]
[null,"DailyScrumDateModifier",null,null,0,null,"Number of days added to or subtracted from today's date to ensure the highlighted date column in the sprint worksheet corresponds to the day of the current daily Scrum meeting"]
[]
["Workbook-Wide Constants"]
[null,"BurndownColumns",null,null,3]
[null,"HoursSpentColumn",null,null,1]
[null,"HoursLeftColumn",null,null,2]
[null,"StatusColumn",null,null,3]

{"sheet":"Capacity","index":2,"n_rows":29,"n_cols":37,"rows_kept":29,"cut":false,"hidden":false,"merged":[[18,36,18,41],[4,1,4,6],[5,36,5,41],[11,36,11,41],[10,36,10,41],[6,36,6,41],[7,36,7,41],[8,36,8,41],[9,36,9,41],[15,36,15,41],[16,36,16,41],[17,36,17,41],[12,36,12,41],[13,36,13,41],[14,36,14,41],[19,36,19,41],[20,36,20,41],[22,36,22,41],[23,36,23,41],[24,36,24,41],[21,36,21,41]]}
[]
[null,"Current Date",null,{"$f":"TEXT(E2,\"ddd\")","v":"Wed"},{"$f":"TODAY()","v":"2017-05-10"}]
[null,"Sprint Start Date",null,{"$f":"TEXT(E3,\"ddd\")","v":"Mon"},"2017-05-01"]
[]
[null,"Sprint Tracking Statistics"]
[null,"Productive Hours =",5,null,"Sprint Days =",30,null,null,{"$f":"IF(D3=\"Mon\",E3-0,IF(D3=\"Tue\",E3-1,IF(D3=\"Wed\",E3-2,IF(D3=\"Thu\",E3-3,IF(D3=\"Fri\",E3-4,IF(D3=\"Sat\",E3-5,IF(D3=\"Sun\",E3-6,\"False\")))))))","v":"2017-05-01"},{"$f":"I6+1","v":"2017-05-02"},"2017-05-03","2017-05-04","2017-05-05","2017-05-06","2017-05-07",{"$f":"I6+7","v":"2017-05-08"},{"$f":"P6+1","v":"2017-05-09"},"2017-05-10","2017-05-11","2017-05-12","2017-05-13","2017-05-14",{"$f":"P6+7","v":"2017-05-15"},{"$f":"W6+1","v":"2017-05-16"},"2017-05-17","2017-05-18","2017-05-19","2017-05-20","2017-05-21",{"$f":"W6+7","v":"2017-05-22"},{"$f":"AD6+1","v":"2017-05-23"},"2017-05-24","2017-05-25","2017-05-26","2017-05-27","2017-05-28"]
[null,null,null,null,"Scrum Team","%age of time on Project","Assigned Hours",null,"M","T","W","T","F","S","S","M","T","W","T","F","S","S","M","T","W","T","F","S","S","M","T","W","T","F","S","S","Available Hours"]
[null,"Total Remaining Hours:",{"$f":"SUM(G8:G25)","v":9},null,"dave@althris.com",1,{"$f":"SUMIF(Sprint!$D$4:$D$1838,E8,Sprint!$CR$4:$CR$1838)","v":9},null,{"$f":"IF(I$6<$E$3,0,IF(ISBLANK($E8),0,IF(I$6<$E$2,0,1)))","v":0},0,{"$f":"IF(K$6<$E$3,0,IF(ISBLANK($E8),0,IF(K$6<$E$2,0,1)))","v":0},0,0,null,null,{"$f":"IF(P$6<$E$3,0,IF(ISBLANK($E8),0,IF(P$6<$E$2,0,1)))","v":0},0,1,1,1,null,null,{"$f":"IF(W$6<$E$3,0,IF(ISBLANK($E8),0,IF(W$6<$E$2,0,1)))","v":1},1,1,1,1,null,null,{"$f":"IF(AD$6<$E$3,0,IF(ISBLANK($E8),0,IF(AD$6<$E$2,0,1)))","v":1},1,1,1,1,null,null,{"$f":"IF(E8=\"unassigned\",0,(COUNTIF(I8:AJ8,1)*$C$6)*F8)","v":65}]
[null,"Total Capacity in Hours:",{"$f":"SUM(AK8:AP25)","v":65},null,null,1,{"$f":"SUMIF(Sprint!$D$4:$D$1838,E9,Sprint!$CR$4:$CR$1838)","v":0},null,0,0,0,0,0,null,null,0,0,0,0,0,null,null,0,0,0,0,0,null,null,0,0,0,0,0,null,null,0]
[null,"Variance in Hours:",{"$f":"C8-C9","v":-56},null,null,1,{"$f":"SUMIF(Sprint!$D$4:$D$1838,E10,Sprint!$CR$4:$CR$1838)","v":0},null,0,0,0,0,0,null,null,0,0,0,0,0,null,null,0,0,0,0,0,null,null,0,0,0,0,0,null,null,0]
[null,null,null,null,null,1,{"$f":"SUMIF(Sprint!$D$4:$D$1838,E11,Sprint!$CR$4:$CR$1838)","v":0},null,0,0,0,0,0,null,null,0,0,0,0,0,null,null,0,0,0,0,0,null,null,0,0,0,0,0,null,null,0]
[null,null,null,null,null,1,{"$f":"SUMIF(Sprint!$D$4:$D$1838,E12,Sprint!$CR$4:$CR$1838)","v":0},null,0,0,0,0,0,null,null,0,0,0,0,0,null,null,0,0,0,0,0,null,null,0,0,0,0,0,null,null,0]
[null,null,null,null,null,1,{"$f":"SUMIF(Sprint!$D$4:$D$1838,E13,Sprint!$CR$4:$CR$1838)","v":0},null,0,0,0,0,0,null,null,0,0,0,0,0,null,null,0,0,0,0,0,null,null,0,0,0,0,0,null,null,0]
[null,null,null,null,null,1,{"$f":"SUMIF(Sprint!$D$4:$D$1838,E14,Sprint!$CR$4:$CR$1838)","v":0},null,0,0,0,0,0,null,null,0,0,0,0,0,null,null,0,0,0,0,0,null,null,0,0,0,0,0,null,null,0]
[null,null,null,null,null,1,{"$f":"SUMIF(Sprint!$D$4:$D$1838,E15,Sprint!$CR$4:$CR$1838)","v":0},null,0,0,0,0,0,null,null,0,0,0,0,0,null,null,0,0,0,0,0,null,null,0,0,0,0,0,null,null,0]
[null,null,null,null,"unassigned",1,{"$f":"SUMIF(Sprint!$D$4:$D$1838,E16,Sprint!$CR$4:$CR$1838)","v":0},null,0,0,0,0,0,null,null,0,0,1,1,1,null,null,1,1,1,1,1,null,null,1,1,1,1,1,null,null,0]
[null,null,null,null,null,null,{"$f":"SUMIF(Sprint!$D$4:$D$1838,E17,Sprint!$CR$4:$CR$1838)","v":0},null,0,0,0,0,0,null,null,0,0,0,0,0,null,null,0,0,0,0,0,null,null,0,0,0,0,0,null,null,0]
[null,null,null,null,null,null,{"$f":"SUMIF(Sprint!$D$4:$D$1838,E18,Sprint!$CR$4:$CR$1838)","v":0},null,0,0,0,0,0,null,null,0,0,0,0,0,null,null,0,0,0,0,0,null,null,0,0,0,0,0,null,null,0]
[null,null,null,null,null,null,{"$f":"SUMIF(Sprint!$D$4:$D$1838,E19,Sprint!$CR$4:$CR$1838)","v":0},null,0,0,0,0,0,null,null,0,0,0,0,0,null,null,0,0,0,0,0,null,null,0,0,0,0,0,null,null,0]
[null,null,null,null,null,null,{"$f":"SUMIF(Sprint!$D$4:$D$1838,E20,Sprint!$CR$4:$CR$1838)","v":0},null,0,0,0,0,0,null,null,0,0,0,0,0,null,null,0,0,0,0,0,null,null,0,0,0,0,0,null,null,0]
[null,null,null,null,null,null,{"$f":"SUMIF(Sprint!$D$4:$D$1838,E21,Sprint!$CR$4:$CR$1838)","v":0},null,{"$f":"IF(I$6<$E$3,0,IF(ISBLANK($E21),0,IF(I$6<$E$2,0,1)))","v":0},0,0,0,0,null,null,{"$f":"IF(P$6<$E$3,0,IF(ISBLANK($E21),0,IF(P$6<$E$2,0,1)))","v":0},0,{"$f":"IF(R$6<$E$3,0,IF(ISBLANK($E21),0,IF(R$6<$E$2,0,1)))","v":0},0,0,null,null,{"$f":"IF(W$6<$E$3,0,IF(ISBLANK($E21),0,IF(W$6<$E$2,0,1)))","v":0},0,0,0,0,null,null,{"$f":"IF(AD$6<$E$3,0,IF(ISBLANK($E21),0,IF(AD$6<$E$2,0,1)))","v":0},{"$f":"IF(AE$6<$E$3,0,IF(ISBLANK($E21),0,IF(AE$6<$E$2,0,1)))","v":0},0,{"$f":"IF(AG$6<$E$3,0,IF(ISBLANK($E21),0,IF(AG$6<$E$2,0,1)))","v":0},0,null,null,0]
[null,null,null,null,null,null,{"$f":"SUMIF(Sprint!$D$4:$D$1838,E22,Sprint!$CR$4:$CR$1838)","v":0},null,0,0,0,0,0,null,null,0,0,0,0,0,null,null,0,0,0,0,0,null,null,{"$f":"IF(AD$6<$E$3,0,IF(ISBLANK($E22),0,IF(AD$6<$E$2,0,1)))","v":0},0,0,0,0,null,null,0]
[null,null,null,null,null,null,{"$f":"SUMIF(Sprint!$D$4:$D$1838,E23,Sprint!$CR$4:$CR$1838)","v":0},null,0,0,0,0,0,null,null,0,0,0,0,0,null,null,0,0,0,0,0,null,null,{"$f":"IF(AD$6<$E$3,0,IF(ISBLANK($E23),0,IF(AD$6<$E$2,0,1)))","v":0},0,0,0,0,null,null,0]
[null,null,null,null,null,null,{"$f":"SUMIF(Sprint!$D$4:$D$1838,E24,Sprint!$CR$4:$CR$1838)","v":0},null,0,0,{"$f":"IF(K$6<$E$3,0,IF(ISBLANK($E24),0,IF(K$6<$E$2,0,1)))","v":0},0,0,null,null,0,0,{"$f":"IF(R$6<$E$3,0,IF(ISBLANK($E24),0,IF(R$6<$E$2,0,1)))","v":0},0,0,null,null,{"$f":"IF(W$6<$E$3,0,IF(ISBLANK($E24),0,IF(W$6<$E$2,0,1)))","v":0},{"$f":"IF(X$6<$E$3,0,IF(ISBLANK($E24),0,IF(X$6<$E$2,0,1)))","v":0},{"$f":"IF(Y$6<$E$3,0,IF(ISBLANK($E24),0,IF(Y$6<$E$2,0,1)))","v":0},0,0,null,null,{"$f":"IF(AD$6<$E$3,0,IF(ISBLANK($E24),0,IF(AD$6<$E$2,0,1)))","v":0},{"$f":"IF(AE$6<$E$3,0,IF(ISBLANK($E24),0,IF(AE$6<$E$2,0,1)))","v":0},{"$f":"IF(AF$6<$E$3,0,IF(ISBLANK($E24),0,IF(AF$6<$E$2,0,1)))","v":0},0,0,null,null,0]
[null,null,null,null,null,null,{"$f":"SUMIF(Sprint!$D$4:$D$1838,E25,Sprint!$CR$4:$CR$1838)","v":0},null,0,0,0,0,0,null,null,0,0,0,0,0,null,null,{"$f":"IF(W$6<$E$3,0,IF(ISBLANK($E25),0,IF(W$6<$E$2,0,1)))","v":0},{"$f":"IF(X$6<$E$3,0,IF(ISBLANK($E25),0,IF(X$6<$E$2,0,1)))","v":0},0,0,0,null,null,{"$f":"IF(AD$6<$E$3,0,IF(ISBLANK($E25),0,IF(AD$6<$E$2,0,1)))","v":0},{"$f":"IF(AE$6<$E$3,0,IF(ISBLANK($E25),0,IF(AE$6<$E$2,0,1)))","v":0},0,0,0,null,null,0]
[]
[]
[]
[null,null,null,null,null,null,null,null,"v","=","Vacation & Public Holiday",null,null,null,null,null,"h","=","OOF (Sick, Biz Travel etc.)"]

{"sheet":"Team Roster","index":3,"n_rows":11,"n_cols":8,"rows_kept":11,"cut":false,"hidden":false,"merged":[]}
[]
[]
[]
[null,"Sprint Vision:"]
[]
[null,"Sprint Team","NAME","EMAIL ALIAS","PHONE","MOBILE PHONE","EMAIL","IM"]
[]
[null,null,"Name","Email","Phone","Mobile"]
[null,null,"Jane Doe","jane.doe@email.com"]
[null,null,"unassigned","unassigned"]
[null,null,"David McCreery","dave@althris.com",878545500]